program: Gaussian 09
title: Fe_N-PCo3-EoohIV-b3lyp-ls-pcm_fromAlb_chg9bb. From the converged LS structure
version: ES64L-G09RevE.01
frameworkgroup: C1[X(Co3FeH3O71P2W18)]
method: UB3LYP
basis: Gen
operation: Freq
keyword: #P
keyword: Geom=AllCheck
keyword: Guess=TCheck
keyword: SCRF=Check
keyword: GenChk
keyword: UB3LYP/ChkBas
keyword: Freq
title: Fe_N-PCo3-EoohIV-b3lyp-ls-pcm_fromAlb_chg9bb. From the converged LS st
converged: YES YES YES YES
polarizability: 2.02702258e+03 -3.10139142e+01 1.69669309e+03 -8.96111227e-01 -1.07318072e+01 1.76392598e+03
1716.lowfreq: -7.8765 -4.9662 -3.4706 -0.0093 -0.0072 -0.0065 23.9288 31.8877 38.6136
redmass: 52.8540 39.5639 41.8530 55.1892 57.9717 64.6615 48.5831 17.5152 44.2041 27.2765 45.9101 56.2570 63.3542 61.4517 66.7167 48.3621 50.3620 48.4094 30.1947 44.7360 28.0365 21.0352 40.3166 37.1260 42.3150 39.8059 35.3112 36.9600 35.8388 35.2573 42.5415 19.1254 24.3868 28.5584 19.4485 25.7634 26.6521 26.6290 27.4365 24.7640 30.5876 19.2024 17.0760 22.5817 26.3220 23.1472 27.6121 14.2050 26.2719 24.4677 26.0496 17.3297 21.5933 22.5857 23.1696 22.0780 22.4347 24.5449 24.1484 22.8072 24.6305 22.8379 26.0370 20.6486 25.0692 24.8776 21.4269 19.4766 24.3677 22.1595 23.5020 22.8895 24.8652 23.9429 22.5374 24.5318 22.1088 22.5584 16.1265 20.8366 15.3649 15.5491 18.1454 17.2701 19.8731 16.7879 18.5841 22.0322 18.6458 18.0662 18.8685 18.9205 20.0882 21.9988 18.7288 18.6334 17.6625 17.2132 19.9257 17.5210 20.8490 16.8373 17.5302 18.1726 19.9615 20.2113 19.8294 20.6743 18.2990 19.8616 17.1810 19.1947 17.2442 19.1143 18.3053 18.1279 18.7460 16.9194 18.1784 17.3833 17.3222 17.2644 17.2542 17.2174 17.6819 17.4705 17.8143 17.4650 18.2561 15.7122 15.9156 20.6343 16.4751 16.8692 16.7191 15.5443 17.3333 16.9428 17.0660 17.0579 16.8770 17.2085 17.1892 17.8188 17.0628 18.0301 17.6742 17.8862 18.5023 18.1636 15.2633 15.8291 14.2216 16.9729 16.5402 17.4260 16.9039 16.8385 14.4719 15.2551 18.0707 14.1503 16.7037 16.8895 14.6231 8.6082 16.8796 6.4827 8.0581 2.5391 7.1787 7.6680 9.5311 16.6388 17.1622 13.1391 16.3793 15.6606 16.9784 15.3394 17.1049 15.8335 16.4625 16.5955 17.4135 17.4477 15.0863 16.4177 16.3760 17.1671 16.3772 16.2854 16.5385 16.9957 16.8889 16.6443 16.6297 16.6961 16.4210 16.9662 17.2110 17.1767 16.5788 16.4354 16.9869 15.7692 16.1454 15.4472 16.1428 17.8415 16.5615 17.0113 16.9160 17.8160 16.7215 17.2948 17.8224 16.7405 16.9495 17.4504 16.4388 16.7096 16.4923 15.7362 16.7080 16.5157 16.0157 16.0734 16.3504 15.4416 16.6508 8.0774 2.4663 5.6101 5.4658 7.6259 1.2958 5.8324 16.4263 11.7102 7.1475 12.4008 15.0484 12.9362 14.0824 10.6592 16.7011 16.8900 16.1462 16.4418 14.8052 16.6409 16.7544 17.0190 16.9790 16.1765 16.2739 17.0616 17.1870 17.4844 16.9044 16.7429 15.2594 16.3394 9.6211 5.3375 1.6024 15.2804 9.8138 14.9295 10.4691 16.6253 16.0426 16.3625 17.0252 14.1129 18.5987 19.3673 18.9308 18.5369 18.8650 19.1702 14.6882 1.0761 1.1152 1.0881 1.0459 1.0855
irintensity: 0.0450 0.1576 0.1777 0.2310 0.2266 0.4404 0.1246 0.4954 0.2263 1.3945 0.5020 4.1799 1.9022 2.8499 1.8989 7.4256 0.7204 0.3858 6.2428 5.3072 4.5555 6.9804 2.4694 1.2625 2.3376 0.8906 1.6869 2.4080 1.4752 9.3289 0.0750 2.1417 0.3649 10.7171 3.4625 7.6788 5.4961 7.6832 2.2535 13.9266 9.9346 0.4335 4.2058 2.7695 6.1931 29.3472 1.8659 6.3019 8.0169 6.1722 17.6061 3.5361 8.4191 24.6601 2.7433 26.6541 0.6569 3.1074 7.2650 9.7899 10.9123 8.9550 0.9509 0.5750 6.8923 17.2783 15.1720 0.8375 3.7785 8.2189 2.5372 6.4924 4.0451 7.6284 55.3033 1.2359 6.4135 12.6119 69.3047 12.3373 4.6021 13.1607 14.0464 3.5527 15.1888 23.4069 9.3610 4.5053 6.2457 6.9905 4.8130 14.1557 1.5527 2.3898 5.3774 18.4019 4.8936 26.9868 24.5548 34.4685 55.1345 9.3265 531.2446 285.7662 117.4614 17.2565 64.8001 62.5537 116.7976 136.4489 55.1839 65.9772 44.4212 69.3263 53.1491 75.0832 82.7018 11.9890 162.6133 112.2509 36.1484 46.7636 33.1772 37.9553 85.0144 57.4486 11.5044 130.6216 145.5099 14.1037 198.1504 277.8013 59.6287 197.0146 97.2519 96.3234 1007.7092 151.3453 169.3040 576.8420 251.6924 79.5744 129.9689 93.8192 10.3490 183.3529 91.0915 573.8313 982.3610 306.5039 271.1229 126.2820 289.4266 18.6901 387.4260 411.6616 56.2369 425.3907 319.2377 52.0748 365.3319 470.4808 294.4234 126.2325 412.8270 94.4548 108.4255 119.2927 33.4743 104.6012 100.8957 176.6674 103.3622 80.6930 8.9536 167.3207 15.8176 94.4456 41.1695 24.7721 28.2469 83.5711 26.1550 182.5160 10.2396 16.8013 46.7758 31.5694 19.9502 81.0467 93.0550 49.1637 97.3774 193.0439 15.7775 131.3386 46.7993 160.4734 6.7821 122.9657 76.1727 105.7576 103.4072 258.5910 299.7907 19.8970 13.5664 14.4122 43.4716 7.8879 201.0343 20.9447 85.9724 120.4082 26.5679 82.3972 81.3274 200.1880 116.4099 153.0293 85.8394 8.8658 87.8464 85.9414 368.6774 483.2177 32.3676 11.5399 1617.8365 1458.0566 4296.1089 2252.5053 4637.6996 8224.9714 834.4553 1900.0690 1004.2063 9153.7985 69.7349 949.5542 2440.1779 1444.4519 123.9372 233.0546 128.8356 1377.3084 939.8087 324.9327 176.4509 39.1378 545.5206 38.2287 140.3300 1258.9149 24.9996 95.4970 131.0627 883.1335 1125.3140 1391.3117 999.4612 269.9763 421.7131 233.2734 177.9177 208.6805 145.4127 1209.0838 20.9441 436.3498 821.3444 3.8015 8.0694 1.8359 23.7231 18.1328 492.8307 158.1680 310.2402 57.5346 589.1128 461.1546 35.7949 71.9474 520.0738 3376.6416 364.3886 284.2647
temp: 298.150 k
press: 1.00000 atm
elementType: 27 27 26 27 1 1 8 8 8 8 8 8 8 8 8 8 8 8 8 8 8 8 8 8 8 8 8 8 8 8 8 8 8 8 8 8 8 8 8 8 8 8 8 8 8 8 8 8 8 8 8 8 8 8 8 8 8 8 8 8 8 8 8 8 8 8 8 8 8 8 8 8 8 8 8 8 15 15 74 74 74 74 74 74 74 74 74 74 74 74 74 74 74 74 74 74 8 1
symmnumber: 1
zpe: 776413.1 jmol-1
zpe.correction: 0.295720 hartree
zpe.thermalcorrener: 0.406650 hartree
zpe.thermalcorrenthalpy: 0.407595 hartree
zpe.thermalcorrgfe: 0.158352 hartree
zpe.sumelectzpe: -7810.334936 hartree
zpe.sumelectthermal: -7810.224006 hartree
zpe.sumelectthermalent: -7810.223062 hartree
zpe.sumelectthermalfe: -7810.472304 hartree
dipole: -7.5287 -4.3947 -2.0675
dipole: 8.9593
quadrupole: -1901.9233 -1351.1861 -1376.9995
quadrupole: 13.9849 4.4013 -1.0825
quadrupole: -358.5537 192.1836 166.3701 13.9849 4.4013 -1.0825
hfenergy: -7810.6306562 hartree
pointgroup: C01 [X(Co3Fe1H3O71P2W18)]
dipole: -2.9620312 -1.7289837 -0.8134267 debye
polarizability: 2027.0217871|-31.0181406|1696.693883|-0.8962485|-10.7317957|1763.9259776 unknown
InChI: InChI=1S/3Co.Fe.2O4P.HO2.H2O.60O.18W/c;;;;2*1-5(2,3)4;1-2;;;;;;;;;;;;;;;;;;;;;;;;;;;;;;;;;;;;;;;;;;;;;;;;;;;;;;;;;;;;;;;;;;;;;;;;;;;;;;;/h;;;;;;1H;1H2;;;;;;;;;;;;;;;;;;;;;;;;;;;;;;;;;;;;;;;;;;;;;;;;;;;;;;;;;;;;;;;;;;;;;;;;;;;;;;
charge -9 multiplicity 12
98 atoms
Co 0.05319331 -0.12715953 1.69289267
Co 0.02563156 0.27282083 -1.63567619
Fe -0.83256431 2.66521731 0.31579187
Co 0.79561711 -2.54733358 -0.29083804
H  -0.32881816 -4.97798755 0.2144442
H  -0.33536964 -4.79282663 -1.33564943
O  -1.38698824 0.90681663 -2.93648319
O  1.38387236 -0.8126334 3.04243536
O  0.66082356 1.88451593 1.6920143
O  -0.49564472 -1.81887402 -1.53965033
O  -5.44624381 -2.41669177 -0.25862014
O  5.63385146 2.20954728 0.2433401
O  -2.20272754 -1.48532614 -3.62347261
O  2.43509411 1.51210526 3.7051221
O  -2.97167835 0.79684616 -5.21118382
O  3.05442404 -0.81956276 5.26330122
O  -3.16147178 -0.66464602 -1.33950534
O  3.25554001 0.65671656 1.36153052
O  -1.36859864 0.5348206 0.07660543
O  1.40525349 -0.43924861 -0.03936527
O  -3.1577312 -0.95129205 1.17747583
O  3.23371124 0.95857723 -1.16294629
O  -3.83881364 1.27085979 0.14633861
O  3.83426935 -1.28816541 -0.15525271
O  -2.31966394 -3.28786012 -0.37019756
O  2.48121224 3.34101909 0.40766938
O  -2.18688444 -2.2861833 3.20711381
O  2.3567405 2.32928812 -3.21433469
O  -3.86475016 1.18656222 3.10771884
O  3.75754977 -1.21570286 -3.11097335
O  -4.32251619 3.85638516 0.44276479
O  4.01825456 -3.92926015 -0.47209143
O  -6.18094558 -0.16247401 -1.28319255
O  6.21117889 -0.07975452 1.26805581
O  -6.74347514 -2.48451214 -2.79457298
O  6.94170131 2.24178878 2.76582327
O  -4.69921779 -0.65167405 -3.45820805
O  4.83948411 0.50914939 3.46296435
O  -3.98991196 -2.97826039 -2.40334244
O  4.22438066 2.88785298 2.39768966
O  -1.40583405 -4.68602795 1.86785481
O  1.70769841 4.73697679 -1.92924575
O  -0.48447483 -2.12794149 1.09911653
O  0.60994509 2.24847421 -1.13345674
O  -3.9757488 -3.46260474 1.6830982
O  4.18657993 3.36775648 -1.66283282
O  -6.72504075 -3.08877691 2.20073656
O  6.89996288 2.834053 -2.21959942
O  -6.18997575 -0.47044932 1.27395193
O  6.19854004 0.22522642 -1.30690005
O  -5.87632732 2.15325527 1.61680156
O  5.70452461 -2.36806007 -1.64908772
O  -8.14987537 1.28882019 0.20735754
O  8.03421618 -1.6498503 -0.22971713
O  -5.91518148 2.4504945 -1.04626814
O  5.72418512 -2.68606133 1.00987233
O  -4.53069342 4.60465216 -2.27573291
O  4.04192088 -4.66310919 2.24595864
O  -2.2783593 3.40100269 -1.15376396
O  2.02428414 -3.11963925 1.02708266
O  1.71669036 4.14331871 3.01158839
O  -1.42022931 -4.13076786 -2.87132092
O  -2.97295008 -0.40991166 5.27553791
O  2.96902902 0.43758645 -5.29954782
O  -4.681612 -1.44542752 3.25049674
O  4.77244281 1.31772021 -3.26867273
O  -1.35602655 0.18790351 3.10537491
O  1.33620915 -0.08866771 -3.11602365
O  -2.21038602 2.94267558 1.80749637
O  2.0059997 -2.79419651 -1.71461734
O  -0.43657379 4.92397344 0.4021049
O  0.23464071 -4.73739702 -0.5453058
O  -4.35429921 3.97451173 3.26086932
O  4.00599545 -4.01446676 -3.28193108
O  -3.89475082 1.87904641 -2.75422037
O  3.79920463 -1.90567319 2.72971548
P  -2.86101148 0.05641134 0.01681216
P  2.91390791 -0.02983273 0.00208108
W  -2.98069224 0.37379841 -3.5352316
W  3.02361337 -0.35899801 3.59461208
W  -3.99093193 2.80981187 2.03775466
W  3.82364513 -2.8217466 -2.0447689
W  -2.06051992 -3.11443583 1.53265428
W  2.21004315 3.14510053 -1.49506238
W  -5.38145378 -2.16083521 1.65008638
W  5.49537199 1.99892512 -1.66438006
W  -2.96760972 -0.4377127 3.54623798
W  2.96933112 0.48218679 -3.56898248
W  -2.07468227 -2.68144809 -2.17666171
W  2.22991152 2.70020082 2.21234167
W  -6.43606701 1.10964534 0.17610236
W  6.34165516 -1.32180491 -0.17863128
W  -5.39263909 -1.71337875 -2.05288
W  5.52102933 1.56235234 2.05912203
W  -4.09697444 3.20318659 -1.37034166
W  3.8439715 -3.21494498 1.32356447
O  -1.25587933 5.52167322 -0.4553723
H  -1.78380857 4.69787316 -0.88247787
