program: Gaussian 09
title: 000032711
version: EM64L-G09RevD.01
frameworkgroup: C1[X(C16H24Cl3N5)]
method: RPBEPBE
basis: SDD
operation: Freq
keyword: #p
keyword: freq=noraman
keyword: PBEPBE/SDD
title: #p freq=noraman PBEPBE/SDD
converged: YES YES NO NO
title: Mulliken charges:
elementType: Cl Cl Cl N N N N N C C C C C C C C C C C C C C C C H H H H H H H H H H H H H H H H H H H H H H H H
charge: 0.108386 0.121389 0.101403 -0.145078 -0.071732 -0.045174 0.016456 -0.012730 -0.071047 -0.348298 -0.381698 -0.704900 0.086703 -0.386104 -0.499091 -0.344187 -0.696357 0.040145 -0.437374 -0.346758 0.253658 -0.695074 -0.783212 -0.154869 0.273001 0.192164 0.211663 0.271601 0.233355 0.213970 0.228549 0.227667 0.230686 0.209878 0.231433 0.222964 0.184351 0.199301 0.227237 0.223251 0.222568 0.258447 0.304851 0.192626 0.199484 0.208314 0.218685 0.209495
chargesum: 0.00000
title: Mulliken charges with hydrogens summed into heavy atoms:
elementType: Cl Cl Cl N N N N N C C C C C C C C C C C C C C C C
charge: 0.108386 0.121389 0.101403 -0.145078 -0.071732 -0.045174 0.016456 -0.012730 0.201953 0.055529 0.123259 -0.034713 0.086703 0.054460 -0.044694 0.039465 -0.023300 0.040145 0.125924 0.045352 0.253658 -0.058580 -0.783212 -0.154869
polarizability: 2.79709408e+02 -1.79365589e+01 2.52429587e+02 -1.78458954e+01 5.23033155e+00 1.92494114e+02
1716.lowfreq: -0.0014 -0.0013 -0.0011 5.8223 8.5144 10.2224 13.8392 21.3462 26.4991
frequency: 13.7509 20.8942 25.3919 33.2151 38.2258 44.1137 59.7694 59.9874 82.4636 87.4034 102.7256 114.4830 118.5759 131.0677 151.0995 157.0956 165.6288 172.7588 195.4827 210.5379 213.9259 222.1851 225.0787 228.1391 238.1964 251.7645 286.6515 291.5412 297.1010 315.8019 363.2405 370.4546 382.3167 385.1948 402.2408 419.7129 452.0605 489.5661 511.5491 552.4384 560.4643 619.1692 630.7707 694.0576 706.3488 730.0769 748.5199 750.8773 760.2039 788.1732 796.0389 814.2070 831.5415 853.2081 861.6623 905.1850 912.4764 918.6860 945.4548 959.4537 971.4348 992.1771 994.2774 1011.7810 1020.2927 1037.8355 1049.9326 1063.7684 1082.9671 1094.3468 1106.8397 1115.9434 1123.0677 1170.3602 1170.9742 1183.6008 1206.8898 1212.7098 1234.9404 1261.3148 1269.8982 1274.6044 1280.1624 1291.8579 1304.2133 1304.6848 1310.6020 1316.6118 1337.0779 1349.4788 1355.7455 1359.3777 1370.5567 1377.2810 1389.2526 1390.4222 1395.2407 1429.2254 1448.3796 1451.3892 1461.5258 1463.7980 1465.9026 1467.6261 1475.9564 1476.7275 1477.6377 1478.8900 1481.5163 1486.0156 1486.5178 1495.4678 1540.4641 2198.6338 2956.2217 2969.6279 2972.1889 2978.0207 2982.1361 2983.4763 2984.8652 2996.7311 3008.0772 3010.1710 3024.0363 3025.9818 3033.6288 3050.1385 3050.3766 3068.1450 3068.5876 3072.5368 3077.8601 3081.3202 3083.3682 3084.6891 3088.4598 3103.8798
redmass: 21.6859 4.6452 5.2604 6.3996 6.6253 3.1720 1.5850 3.5451 5.5331 5.5158 3.2429 2.9448 2.4431 3.1986 6.4138 4.2671 3.6601 6.0184 2.6903 3.6701 4.0134 1.4477 2.4416 1.2873 1.4858 4.8040 7.4690 2.8921 7.1149 3.0451 4.3539 4.9994 3.0923 4.4767 3.1323 3.7925 3.8678 5.0560 4.2469 3.7939 4.8312 4.9991 8.6362 4.0028 3.1019 1.2732 1.6727 4.6021 6.5150 1.5567 1.3698 2.0931 4.2638 2.0599 2.6514 7.1393 2.3469 1.5862 4.4863 1.6920 1.4707 1.9229 2.8258 2.1049 3.6017 3.0863 2.9849 2.0916 2.0892 2.0790 1.9680 2.3334 2.3124 2.6232 2.0301 3.0799 1.8720 1.4012 1.6701 1.3005 1.3159 1.3494 1.2572 1.0682 1.5792 1.5013 2.0742 1.2338 1.5134 1.4848 1.7595 1.3262 1.5811 2.0430 1.2246 1.2287 1.2100 5.8148 1.2035 1.1078 1.1411 1.0933 1.0694 1.0814 1.0611 1.0797 1.0440 1.0558 1.0745 1.0644 1.0983 5.2981 4.9056 12.4252 1.0589 1.0586 1.0370 1.0574 1.0370 1.0389 1.0605 1.0974 1.0581 1.0611 1.1018 1.0963 1.0601 1.1029 1.0900 1.1013 1.1008 1.0993 1.0993 1.0987 1.0991 1.1023 1.0999 1.1050
irintensity: 0.0334 0.6259 0.2361 0.9669 1.9453 0.0407 0.1086 0.4069 0.3773 3.2194 2.0021 1.2461 1.2305 0.4918 6.3813 0.0891 0.1249 1.4974 2.1240 0.1649 0.3006 0.0670 0.1527 0.0572 0.3727 0.1210 1.3335 0.5911 1.2447 1.1295 0.8565 1.8798 0.4836 0.6755 0.6925 0.2870 2.2256 1.2575 15.1887 5.5670 20.9576 24.8624 59.7780 17.3263 70.5316 6.6530 12.5975 112.9061 79.1621 9.1495 6.7304 3.6170 0.6269 10.1596 18.6889 12.7290 10.4675 10.5085 1.5777 7.5523 15.0342 12.4766 23.8346 5.0420 4.1119 3.0234 2.8055 12.7982 22.9888 21.6896 3.5490 11.5041 9.1642 21.9774 14.4540 39.6709 4.9020 14.6112 1.2797 25.1319 9.2070 13.3919 4.8274 3.4062 50.0840 9.0248 15.8257 0.7807 3.8016 1.3133 35.0367 42.6126 0.3000 24.6380 10.7916 13.9953 13.3984 289.0499 22.9232 18.4064 26.8720 3.5951 1.0499 1.8135 3.1621 6.9166 22.6278 13.1128 4.2997 16.9161 7.4692 290.7531 745.6057 18.1981 10.5937 49.0341 27.5846 28.8303 60.3354 6.2815 54.6691 6.4342 9.2104 16.4108 11.7060 10.6284 16.3175 39.1399 7.8854 4.7155 90.9816 55.9222 4.9315 55.4735 51.1546 27.7433 38.1172 7.8253
temp: 298.150 k
press: 1.00000 atm
elementType: 17 17 17 7 7 7 7 7 6 6 6 6 6 6 6 6 6 6 6 6 6 6 6 6 1 1 1 1 1 1 1 1 1 1 1 1 1 1 1 1 1 1 1 1 1 1 1 1
symmnumber: 1
zpe: 1004822.0 jmol-1
zpe.correction: 0.382717 hartree
zpe.thermalcorrener: 0.410548 hartree
zpe.thermalcorrenthalpy: 0.411493 hartree
zpe.thermalcorrgfe: 0.320318 hartree
zpe.sumelectzpe: -2276.173646 hartree
zpe.sumelectthermal: -2276.145814 hartree
zpe.sumelectthermalent: -2276.144870 hartree
zpe.sumelectthermalfe: -2276.236044 hartree
dipole: -4.0328 -5.3614 2.2711
dipole: 7.0828
quadrupole: -191.6788 -162.9576 -164.5329
quadrupole: -0.5773 10.0821 -1.9116
quadrupole: -18.6224 10.0988 8.5235 -0.5773 10.0821 -1.9116
hfenergy: -2276.5563621 hartree
pointgroup: C01 [X(C16H24Cl3N5)]
dipole: -1.6270866 -2.0753207 0.9003368 debye
polarizability: 279.1316303|-18.5277963|253.1499629|-17.4378416|5.1935924|192.3515156 unknown
InChI: InChI=1S/C16H24Cl3N5/c1-4-6-7-9-13-21-14(16(17,18)19)23-15(22-13)24(11-8-10-20)12(3)5-2/h12H,4-9,11H2,1-3H3
charge 0 multiplicity 1
48 atoms
Cl 0.632449 4.392819 1.179618
Cl 2.268512 3.164214 -1.032375
Cl -0.630158 3.843904 -1.524254
N  1.187533 -1.556094 0.193173
N  -0.767597 -0.573788 1.126315
N  0.915375 0.771293 -0.018407
N  -1.081241 1.813859 0.868217
N  5.865094 -0.814803 -1.1669
C  0.740083 -2.914999 0.640553
C  0.363267 -3.816806 -0.56619
C  2.426976 -1.41736 -0.600293
C  1.801922 -3.574963 1.547195
C  0.426713 -0.443488 0.443675
C  -3.997687 0.720401 1.017771
C  -2.81429 0.489329 2.004648
C  -4.143892 -0.392285 -0.043499
C  -0.709946 -3.204768 -1.490322
C  -1.481742 0.569479 1.307264
C  3.588909 -0.773888 0.216771
C  -5.333613 -0.153825 -1.001593
C  0.118391 1.831305 0.227405
C  -5.477981 -1.264732 -2.063891
C  0.589161 3.210716 -0.259312
C  4.850394 -0.788716 -0.539179
H  -0.173274 -2.726267 1.229982
H  1.270301 -4.070624 -1.151919
H  -0.005155 -4.773813 -0.147437
H  2.23163 -0.784786 -1.482725
H  2.722537 -2.420453 -0.947816
H  2.747144 -3.769229 1.006561
H  2.021679 -2.946029 2.427924
H  1.424777 -4.547824 1.909862
H  -3.858327 1.701139 0.523314
H  -4.930781 0.787114 1.611132
H  -2.844225 1.274091 2.782911
H  -2.904244 -0.49946 2.485942
H  -4.270061 -1.371899 0.463391
H  -3.210985 -0.470337 -0.639335
H  -1.624876 -2.951102 -0.924256
H  -0.987737 -3.911397 -2.292653
H  -0.345602 -2.278764 -1.971304
H  3.733842 -1.316351 1.168666
H  3.314036 0.270265 0.451485
H  -6.269868 -0.079761 -0.411334
H  -5.204341 0.826295 -1.50388
H  -5.64291 -2.250137 -1.58833
H  -6.329816 -1.069365 -2.740669
H  -4.564376 -1.340111 -2.683801
