program: Gaussian 09
title: 000032601
version: EM64L-G09RevD.01
frameworkgroup: C1[X(C12H16O2)]
method: RPBEPBE
basis: SDD
operation: Freq
keyword: #pfreq=noraman
keyword: PBEPBE/SDD
title: #p freq=noraman PBEPBE/SDD
converged: YES YES NO NO
title: Mulliken charges:
elementType: O O C C C C C C C C C C C C H H H H H H H H H H H H H H H H
charge: -0.409320 -0.236654 -0.415988 -0.310454 -0.340952 0.478847 -0.353199 0.144367 -0.697590 -0.382086 -0.431919 -0.235607 -0.224522 -0.242987 0.226746 0.204053 0.244374 0.216627 0.180034 0.199388 0.194620 0.212952 0.209285 0.216465 0.262120 0.234177 0.226103 0.226431 0.228956 0.375732
chargesum: 0.00000
title: Mulliken charges with hydrogens summed into heavy atoms:
elementType: O O C C C C C C C C C C C C
charge: -0.033588 -0.236654 0.014812 -0.066080 0.055710 0.478847 0.040809 0.144367 -0.058889 -0.119966 -0.197742 -0.009505 0.001909 -0.014031
polarizability: 1.23578231e+02 1.48458971e+01 1.42559519e+02 -4.04264367e+00 2.87480664e+00 1.25036872e+02
1716.lowfreq: -8.3084 -0.0007 -0.0005 -0.0003 4.6602 9.3612 34.0617 40.3033 43.3935
frequency: 34.0375 40.2800 43.3802 65.5870 88.4772 101.2228 126.2089 180.9000 201.0316 231.3653 251.0946 288.3170 330.7313 401.2599 404.7650 452.8891 493.2808 572.6644 609.2405 621.4378 634.6329 705.2975 712.2056 726.4356 752.6372 779.3102 822.5781 855.8178 873.8528 913.7488 930.5490 938.0079 978.8349 988.8821 993.9312 998.5731 1026.9574 1044.0227 1046.7225 1077.8381 1080.4518 1111.6989 1122.5505 1172.2549 1190.5671 1191.9305 1206.3789 1225.3883 1259.3745 1269.2135 1290.8638 1298.3313 1323.3816 1337.4302 1352.1715 1357.0888 1384.4609 1390.2278 1442.6978 1462.3051 1468.1141 1477.2096 1477.7245 1480.7569 1487.9616 1593.1074 1609.6967 1654.8393 2959.7151 2968.8247 2973.2150 2982.3745 3005.0145 3025.4184 3036.7668 3055.9281 3070.1225 3072.6806 3119.7852 3125.7023 3137.5533 3147.5265 3163.5636 3499.6334
redmass: 6.0755 3.5121 4.1491 1.6954 3.6482 4.2807 2.9416 2.7418 3.3529 1.2190 3.0675 5.6518 5.4551 2.9401 2.8289 3.9840 3.4722 3.0319 3.9121 2.7612 1.9493 1.9302 3.5308 1.1481 1.5534 1.9381 1.8716 1.2483 2.7267 1.7688 1.3802 1.8892 1.3947 5.2000 2.3157 1.7166 2.2408 2.0111 2.5238 1.6636 2.3891 2.2027 1.8749 1.0651 1.2145 2.0800 1.4704 1.3449 1.3897 1.3346 1.0647 1.3085 1.4722 1.2819 1.6781 1.6369 6.0956 1.2150 2.1432 1.0807 1.0710 1.0558 1.0741 2.1428 1.0865 6.0666 6.0306 8.2170 1.0607 1.0600 1.0364 1.0625 1.0954 1.0972 1.0909 1.0995 1.1005 1.0995 1.0857 1.0871 1.0919 1.0963 1.1016 1.0638
irintensity: 2.0856 0.0046 0.6252 0.0827 0.8373 0.1502 0.3018 0.6520 1.1647 0.0226 0.1881 2.3480 2.1848 2.0147 0.0252 5.9126 1.1852 54.0724 19.4969 49.9397 73.2449 54.6316 30.2990 19.7546 15.7936 23.5289 1.1702 0.0803 5.2843 2.0928 4.2045 8.3784 0.2941 10.9069 16.8136 9.1284 20.0702 25.6748 196.1374 11.6936 14.9960 9.4606 26.6296 0.1755 0.2722 0.2089 0.8584 5.0784 4.3078 8.3012 0.7896 2.8175 25.9309 1.0565 25.3250 15.9834 3.0795 10.7120 11.1626 2.6965 0.5249 11.0963 4.3725 19.2229 16.7836 2.2467 9.8486 181.1004 3.5738 46.0069 34.4250 42.3572 3.6906 8.4143 6.3105 39.3621 88.1059 59.2032 5.0370 0.3862 15.6925 29.8579 23.1454 20.3637
temp: 298.150 k
press: 1.00000 atm
elementType: 8 8 6 6 6 6 6 6 6 6 6 6 6 6 1 1 1 1 1 1 1 1 1 1 1 1 1 1 1 1
symmnumber: 1
zpe: 660344.7 jmol-1
zpe.correction: 0.251512 hartree
zpe.thermalcorrener: 0.266010 hartree
zpe.thermalcorrenthalpy: 0.266954 hartree
zpe.thermalcorrgfe: 0.208079 hartree
zpe.sumelectzpe: -616.277304 hartree
zpe.sumelectthermal: -616.262806 hartree
zpe.sumelectthermalent: -616.261862 hartree
zpe.sumelectthermalfe: -616.320737 hartree
dipole: 0.2880 -0.6786 -1.1837
dipole: 1.3945
quadrupole: -82.3492 -79.4207 -84.1563
quadrupole: 1.9389 -0.0532 -3.9073
quadrupole: -0.3738 2.5547 -2.1809 1.9389 -0.0532 -3.9073
hfenergy: -616.5288158 hartree
pointgroup: C01 [X(C12H16O2)]
dipole: -0.0360189 -0.2116558 0.5048864 debye
polarizability: 130.0106901|-17.8838828|134.743236|-0.9329547|-4.2960676|126.4206955 unknown
InChI: InChI=1S/C12H16O2/c1-2-3-9-11(12(13)14)10-7-5-4-6-8-10/h4-8,11,13H,2-3,9H2,1H3
charge 0 multiplicity 1
30 atoms
O  0.758681 3.292534 0.493233
O  0.221793 2.618616 -1.660361
C  -1.65588 0.712065 -0.340281
C  -0.271812 1.114774 0.254208
C  -2.304128 -0.476231 0.399796
C  0.776336 -0.00099 0.113229
C  -3.679222 -0.862513 -0.192341
C  0.236604 2.377129 -0.432303
C  -4.336057 -2.048514 0.545883
C  1.224511 -0.418291 -1.166936
C  1.288328 -0.647877 1.264663
C  2.160837 -1.468224 -1.28871
C  2.224043 -1.700788 1.143384
C  2.66218 -2.115627 -0.134858
H  -1.528502 0.472406 -1.412988
H  -2.332892 1.588836 -0.292519
H  -0.390679 1.349666 1.326878
H  -1.628701 -1.353596 0.361018
H  -2.427959 -0.222308 1.473841
H  -3.553736 -1.116039 -1.264658
H  -4.354675 0.016811 -0.157968
H  -3.694159 -2.948291 0.499211
H  -4.500788 -1.809466 1.613583
H  -5.315068 -2.308091 0.102903
H  0.851079 0.090518 -2.063341
H  0.953718 -0.327252 2.258708
H  2.502374 -1.779258 -2.282524
H  2.609493 -2.193714 2.043046
H  3.388136 -2.930788 -0.231033
H  1.111646 4.085701 0.003838
