program: Gaussian 09
title: a
version: EM64L-G09RevD.01
frameworkgroup: C1[X(FeH2NO40SiW11)]
method: UPBE1PBE
basis: Gen
operation: Freq
keyword: #p
keyword: guess=read
keyword: geom=check
keyword: freq
keyword: iop(5/13=1)
keyword: PBE1PBE/gen
keyword: EmpiricalDispersion=GD3
keyword: scrf=(solvent=water,PCM)
keyword: scf=(conver=7,maxcycle=300)
keyword: pseudo=read
keyword: test
title: #p guess=read geom=check freq iop(5/13=1) PBE1PBE/gen EmpiricalDispers
basis: NPDir=0 NMtPBC= 1 NCelOv= 1 NCel= 1 NClECP= 1 NCelD= 1
basis: NCelK= 1 NCelE2= 1 NClLst= 1 CellRange= 0.0.
basis: One-electron integrals computed using PRISM.
basis: 1 Symmetry operations used in ECPInt.
basis: ECPInt: NShTT= 36856 NPrTT= 226369 LenC2= 30753 LenP2D= 111307.
basis: LDataN: DoStor=T MaxTD1= 6 Len= 172
basis: NBasis= 866 RedAO= T EigKep= 2.04D-03 NBF= 866
basis: NBsUse= 866 1.00D-06 EigRej= -1.00D+00 NBFU= 866
converged: YES YES NO YES
polarizability: 9.57479988e+02 1.72566459e+00 9.48389103e+02 -3.23421346e+00 7.08280815e+00 9.59889095e+02
1716.lowfreq: -4.5539 -3.5386 -0.0047 -0.0038 -0.0032 0.5094 25.5282 36.1591 63.7169
frequency: 25.5134 36.1512 63.7138 68.5690 72.9025 83.7731 84.4586 86.3102 97.5675 102.7126 106.9942 109.9312 112.4349 117.0433 118.5486 128.9706 134.1889 135.5532 140.9063 144.1681 146.5566 150.3858 154.7510 156.7382 158.4246 160.3596 163.5685 167.1283 169.9812 172.1062 174.6921 176.2300 179.7936 187.5603 190.8928 191.4686 193.6706 196.3888 198.3805 199.8022 201.7543 206.0795 208.3801 210.7566 211.8004 213.0213 217.9712 219.0733 221.6504 223.6967 226.9457 228.2451 230.4554 233.5776 234.4209 238.2566 242.4421 243.0872 252.4735 255.7514 263.9810 265.6605 274.1792 276.6877 287.6948 292.3031 294.0448 297.8434 299.9318 304.1275 324.5972 326.2733 328.2368 330.2576 332.7459 333.8257 338.6051 342.5814 354.0791 361.7968 364.2000 371.0820 372.1098 375.0530 376.7747 378.1377 380.6608 383.2168 388.1816 391.5817 396.5074 401.5937 413.5232 417.1211 423.4144 432.8522 434.8340 439.0202 454.5175 457.2130 470.0983 477.4869 490.0292 493.0356 497.7179 508.3905 520.2805 524.2502 528.8996 534.1007 540.9862 546.2611 547.4307 548.9037 552.4755 558.9304 560.6548 564.4810 573.6526 574.9961 581.8395 589.4377 614.6764 634.3301 648.2950 653.3890 656.0864 686.0901 706.7722 754.0052 782.4032 805.9535 817.4538 875.1326 879.4125 884.2122 890.6153 899.6394 900.8092 902.2965 904.6707 907.1780 909.3345 912.9021 927.1695 983.0736 984.0377 986.7524 991.9905 994.6515 997.0036 998.5381 1007.2215 1021.1866 1024.4000 1025.9316 1026.4802 1276.4946 1377.0613 1657.2411 2885.8830 3514.4909
redmass: 9.3992 55.8165 52.5851 40.7182 56.0417 64.3657 61.2676 36.2217 18.9631 36.8355 52.2915 37.4130 29.6312 36.7715 44.1138 9.3586 19.3290 31.0351 17.7439 38.2837 23.8039 23.4902 25.0343 20.8804 25.6046 21.3214 24.1927 19.4435 18.9021 18.8586 19.0355 19.8919 22.8265 25.2156 25.0490 23.2536 20.0101 21.3091 27.4513 23.2430 22.9050 26.6783 22.3290 21.4822 24.9157 25.9267 18.2587 23.1830 24.0059 34.2319 19.7982 18.5079 17.8154 17.5435 18.0694 16.8257 19.1020 18.5901 17.3223 16.2568 13.9521 14.1067 16.2884 16.7887 17.9901 17.6159 17.3354 17.4423 16.3665 16.3141 16.3707 14.6756 15.4369 16.0565 16.8232 16.3413 16.9708 15.5133 7.0702 12.4294 4.5643 9.6850 7.5753 7.7111 13.7394 5.4624 13.4975 4.7051 12.3961 8.6932 12.9672 16.8122 15.2269 15.7910 16.5975 16.5173 16.4052 16.6177 16.8105 16.8843 17.1380 16.8902 16.3953 16.4355 16.5489 16.2611 18.3343 17.5110 17.4860 17.1415 17.2091 17.0161 17.6377 17.1825 17.4434 17.5671 17.5910 16.5123 16.1451 16.5612 16.2130 16.2846 16.6083 16.2588 16.4064 16.3501 16.2481 16.3203 16.5222 16.6359 16.7493 16.4191 16.9685 16.9973 17.1038 16.2510 16.8434 16.9597 17.0081 17.0471 17.2646 18.2232 18.1663 17.5590 18.2458 16.8750 16.8085 16.8686 16.5135 16.4989 16.5341 16.5252 17.2741 1.0570 17.1473 16.9276 17.0955 12.8136 1.0951 1.1434 1.0763 1.0769
irintensity: 1.2137 0.1008 0.0491 0.3794 0.0369 0.3305 0.7440 0.0438 0.9338 1.8483 5.8571 0.3685 0.4067 3.2500 1.7088 2.4469 2.0927 1.5627 5.5390 0.0476 5.1741 7.1305 1.0305 3.8307 1.9387 0.9504 13.3309 0.5978 0.2953 17.5795 3.7114 1.2482 0.6276 11.0530 9.1187 4.0292 5.0713 2.3448 3.1268 0.2134 2.4884 6.3706 4.0264 3.9267 0.6004 14.9815 2.1344 6.7689 1.2745 13.0993 1.3142 1.0121 3.3900 3.2690 3.5797 52.9445 83.6858 111.6918 65.1864 4.3922 20.3463 33.3569 28.2046 16.0916 241.6115 86.4778 85.0981 80.8619 34.5046 75.2246 115.4713 97.0814 100.0809 171.2458 16.2410 140.1695 92.7880 279.0714 238.5686 418.0377 450.4719 258.3610 641.0437 234.1313 50.5980 81.8577 224.7337 306.4161 320.5466 217.5172 65.0886 224.5912 238.0378 47.6557 49.2590 1.5829 19.2000 30.5063 1.6513 5.7172 16.0942 16.6442 42.6890 65.6596 94.8551 5.8151 122.7522 42.3883 64.3093 135.6151 16.4031 56.8798 342.4689 216.6977 335.1016 2.3003 118.8575 7.8345 17.9866 79.2768 21.5450 81.8879 221.7104 59.5744 19.4942 26.8885 130.4043 3000.9846 2969.5443 2166.3391 7530.6194 2456.0962 3406.4091 1003.2502 630.5633 86.8219 637.3901 60.8180 67.6603 3.2289 403.8156 2029.2432 1594.3369 134.1707 1757.4816 796.3186 573.9334 551.1344 21.3281 6.3027 14.3043 19.0516 79.0615 192.4622 62.0886 75.2037 93.3824 91.2540 161.7686 283.1932 2818.7457 3.2854
temp: 298.150 k
press: 1.00000 atm
elementType: 74 74 74 74 74 74 74 74 74 74 74 14 8 8 8 8 8 8 8 8 8 8 8 8 8 8 8 8 8 8 8 8 8 8 8 8 8 8 8 8 8 8 8 8 8 8 8 8 8 8 8 26 7 8 1 1
symmnumber: 1
zpe: 462654.4 jmol-1
zpe.correction: 0.176216 hartree
zpe.thermalcorrener: 0.237377 hartree
zpe.thermalcorrenthalpy: 0.238321 hartree
zpe.thermalcorrgfe: 0.086931 hartree
zpe.sumelectzpe: -4223.722321 hartree
zpe.sumelectthermal: -4223.661160 hartree
zpe.sumelectthermalent: -4223.660216 hartree
zpe.sumelectthermalfe: -4223.811606 hartree
dipole: 2.2193 1.7984 5.8186
dipole: 6.4819
quadrupole: -788.8899 -785.7360 -736.9676
quadrupole: 7.5249 13.9290 8.5130
quadrupole: -18.3587 -15.2048 33.5636 7.5249 13.9290 8.5130
hfenergy: -4223.8985372 hartree
pointgroup: C01 [X(Fe1H2N1O40Si1W11)]
dipole: -0.0534998 -0.3326204 2.5278447 debye
polarizability: 959.2952127|2.1400329|946.7389863|4.2412612|-4.8384228|959.723987 unknown
InChI: InChI=1S/Fe.H2NO.O4Si.35O.11W/c;1-2;1-5(2,3)4;;;;;;;;;;;;;;;;;;;;;;;;;;;;;;;;;;;;;;;;;;;;;;/h;1-2H;;;;;;;;;;;;;;;;;;;;;;;;;;;;;;;;;;;;;;;;;;;;;;;/q+1;-1;;;;;;;;;;;;;;;;;;;;;;;;;;;;;;;;;;;;;;;;;;;;;;;
charge -6 multiplicity 4
56 atoms
W  1.70333865 -2.5922827 1.7522727
W  1.60497029 -2.63120405 -1.64857156
W  1.49994414 3.22012953 0.05147513
W  -2.84638829 -0.57576673 2.10426524
W  3.02715332 0.80226399 -1.67968776
W  -2.95402447 -0.55729349 -1.65108084
W  -1.68366507 2.5321601 -1.67371001
W  -0.18024116 0.09526536 -3.42690949
W  3.10918873 0.77663122 1.73770501
W  -1.1661309 -3.25804509 0.11486879
W  -1.56136739 2.5022242 2.08084194
Si 0.02539535 0.04372801 0.1156923
O  -4.42742897 -1.11221265 2.52065585
O  2.83732645 2.66301048 1.28686526
O  1.42757881 0.90770982 0.08498123
O  -1.99231095 -0.72593257 3.68972063
O  4.60320805 0.87381731 2.59481442
O  0.08230962 3.10853061 -1.2365747
O  0.47337682 -1.58111203 -2.80810751
O  0.40984173 -1.55789977 0.09177651
O  -2.04496804 -2.20571288 1.4281771
O  -2.07381662 2.5826798 0.12950013
O  2.72902662 -1.08667323 -1.63242132
O  1.45693761 0.82259487 -2.82273178
O  0.77163795 -1.71445486 2.99415869
O  2.66995743 -3.67355558 2.68311188
O  -0.8684279 0.39794228 -1.22221763
O  0.14151555 3.10705126 1.36525152
O  4.27035847 0.916397 -2.86071387
O  2.89431576 -1.11237196 1.49895303
O  1.90830915 0.84263838 3.03664108
O  2.40924447 -3.61813461 -2.80246582
O  -2.09951538 -2.20604211 -1.17841161
O  -0.83198696 0.39483771 1.46528151
O  -0.81379693 1.96919474 3.61789546
O  2.36688963 -3.2257294 -0.05954977
O  0.06561542 -3.72758839 -1.29152229
O  4.00310576 0.7242412 -0.11680982
O  -3.25447537 -0.3022473 0.15422969
O  2.68509379 2.66737583 -1.36495155
O  -3.16077421 1.32655664 -1.98254588
O  1.81413197 4.90910366 0.03639964
O  -1.95705052 -0.6177927 -3.32022889
O  -2.37971349 3.99252112 -2.2595454
O  0.09511197 -0.03477554 -5.11987289
O  -4.47764856 -1.12288875 -2.21523964
O  -2.29169304 3.99686597 2.53052963
O  0.18446591 -3.76366198 1.35951677
O  -2.12613781 -4.68246947 0.13311276
O  -0.95317934 1.84281292 -3.34675191
O  -3.08184177 1.32420898 2.2706505
Fe 0.02017668 0.09105677 3.49596092
N  0.01893832 -0.26271674 5.60914802
O  -1.09880409 -0.83803075 6.04759961
H  0.63160033 -0.19175392 6.4230877
H  -1.65588395 -0.89085554 5.20018298
