program: Orca
programVersion: 4.2.1
elementType: Ru P O N C C C H C H C H C C C C H H H C H H H C H H H C C H H H C H H H C H H H C C C C H C H H H N H H H H O C O H C H H O H
elementType: Ru
charge: 0
multiplicity: 1
keywords: PAL8
keywords: RKS wB97M-V def2-TZVPP def2-tzvpp/c def2/j tightscf rijcosx GRID6
keywords: CPCM
formula: C22H33N2O4PRu
InChI: InChI=1S/C19H27N2P.C2H4O3.CO.Ru.2H/c1-18(2,3)22(19(4,5)6)14-15-10-9-12-17(21-15)16-11-7-8-13-20-16;3-1-2(4)5;1-2;;;/h7-13H,14H2,1-6H3;3-4H,1H2;;;;/q-2;;;+2;;
63 atoms
Ru -1.981277 0.506626 -0.323738
P  -2.298881 -1.720252 0.035412
O  -3.342421 0.726507 -2.982164
N  -0.890204 0.380803 1.485905
C  -0.884403 -2.015327 1.191408
C  -0.546129 -0.810009 2.005172
C  0.158914 -0.873426 3.198846
H  0.418671 -1.837016 3.615161
C  0.532832 0.302516 3.828454
H  1.080112 0.270291 4.761159
C  0.22931 1.519899 3.245938
H  0.546697 2.443922 3.706882
C  -0.483307 1.5350 2.053661
C  -2.821974 0.632635 -1.943107
C  -3.813541 -2.204188 1.061836
C  -5.084626 -1.720055 0.367469
H  -5.942794 -1.910143 1.016049
H  -5.047746 -0.649265 0.168673
H  -5.270259 -2.233017 -0.574246
C  -3.921747 -3.698618 1.345958
H  -4.742838 -3.865197 2.047596
H  -4.141325 -4.283634 0.454895
H  -3.019726 -4.101178 1.808816
C  -3.688168 -1.482492 2.405793
H  -2.876299 -1.883517 3.013903
H  -3.536176 -0.409904 2.285384
H  -4.61162 -1.624998 2.970838
C  -2.013049 -2.989314 -1.331086
C  -3.301012 -3.192105 -2.124638
H  -4.058098 -3.742673 -1.568549
H  -3.735451 -2.24437 -2.446056
H  -3.078164 -3.768951 -3.024947
C  -1.491064 -4.332006 -0.821296
H  -1.335779 -4.993365 -1.676858
H  -0.527926 -4.232785 -0.32111
H  -2.174343 -4.838007 -0.145355
C  -0.958881 -2.405367 -2.271438
H  -1.317696 -1.505428 -2.769163
H  -0.030627 -2.154977 -1.755176
H  -0.727206 -3.145395 -3.04152
C  -0.793731 2.739707 1.283667
C  -0.445495 4.018962 1.700984
C  -1.663233 3.591826 -0.689081
C  -0.71185 5.102538 0.887714
H  0.038497 4.158536 2.657283
C  -1.32802 4.882713 -0.334595
H  -2.152613 3.378529 -1.630132
H  -0.441707 6.101885 1.201216
H  -1.553254 5.696528 -1.009261
N  -1.409656 2.533895 0.091155
H  -3.411233 0.8380 0.448421
H  -1.002817 -2.902456 1.815252
H  -0.023463 -2.19419 0.535842
H  -0.353591 0.150791 -0.979237
O  1.637123 -0.886316 -0.701623
C  1.191638 0.197358 -1.093431
O  1.475548 1.351063 -0.348088
H  1.829481 1.026214 0.492023
C  1.1701 0.591894 -2.560378
H  0.656312 -0.177203 -3.135547
H  2.223676 0.600593 -2.881286
O  0.550187 1.826554 -2.818344
H  0.794546 2.406936 -2.08631
elementType: Ru P O N C H
totalener: -1704.93172787 hartree
nucrepener: 3861.64452443 hartree
electener: -5566.57625230 hartree
twoeener: 4486.42250918 hartree
cpcmener: -0.03175306 hartree
kineticenergy: 1639.60007594 hartree
exchangeener: -143.329325120081 hartree
correlationener: -7.931772458078 hartree
xcener: -150.397517188750 hartree
chargesum: -0.0000000
charge: -0.191648 0.386931 -0.235921 -0.051079 -0.279532 0.118114 -0.150473 0.146985 -0.115523 0.162160 -0.101170 0.145957 0.056398 0.030331 0.010349 -0.381462 0.128608 0.142573 0.135599 -0.414722 0.134299 0.130979 0.133824 -0.408984 0.129603 0.155080 0.135668 -0.001233 -0.421338 0.132905 0.144236 0.131429 -0.364962 0.128917 0.126363 0.141405 -0.421918 0.137567 0.138055 0.132388 0.228371 -0.136448 -0.019011 -0.119557 0.145865 -0.113911 0.146104 0.163815 0.159413 -0.142424 -0.201053 0.161938 0.190860 -0.208183 -0.476890 0.366909 -0.345625 0.182900 0.006931 0.106494 0.106264 -0.359257 0.199736
charge: -0.417627 0.913296 0.162120 0.273695 -0.115734 -0.142432 0.013666 0.036377 0.028862 0.037936 0.015603 0.032646 -0.126972 -0.317161 -0.279903 -0.001394 0.017077 0.013882 0.011527 -0.002576 0.020823 0.010282 0.013652 0.002440 0.016360 0.013787 0.018694 -0.282239 0.000254 0.009908 0.019376 0.021441 0.004005 0.020559 0.016031 0.010700 -0.006263 0.018058 0.013923 0.015476 -0.118990 0.021931 -0.047989 0.027118 0.034121 -0.000034 0.034922 0.036830 0.034517 0.267833 -0.117139 0.022003 0.033624 -0.015779 -0.017655 -0.505636 0.292926 -0.117443 -0.132689 0.020463 0.011816 0.263674 -0.138577
qa: -0.1916 0.3869 -0.2359 -0.0511 -0.2795 0.1181 -0.1505 0.1470 -0.1155 0.1622 -0.1012 0.1460 0.0564 0.0303 0.0103 -0.3815 0.1286 0.1426 0.1356 -0.4147 0.1343 0.1310 0.1338 -0.4090 0.1296 0.1551 0.1357 -0.0012 -0.4213 0.1329 0.1442 0.1314 -0.3650 0.1289 0.1264 0.1414 -0.4219 0.1376 0.1381 0.1324 0.2284 -0.1364 -0.0190 -0.1196 0.1459 -0.1139 0.1461 0.1638 0.1594 -0.1424 -0.2011 0.1619 0.1909 -0.2082 -0.4769 0.3669 -0.3456 0.1829 0.0069 0.1065 0.1063 -0.3593 0.1997
va: 5.4005 3.8886 2.2792 3.1363 3.7530 3.7639 3.9527 0.9958 3.9655 0.9865 3.9186 1.0038 3.9021 3.5586 3.9172 3.7798 0.9911 0.9993 0.9812 3.8057 0.9966 0.9832 0.9809 3.7580 0.9800 0.9978 0.9947 3.8805 3.8069 0.9826 0.9833 0.9977 3.7912 0.9926 0.9874 0.9813 3.7336 0.9844 1.0340 1.0005 3.6866 3.9352 3.9505 3.9387 1.0066 3.8743 0.9915 0.9856 0.9882 3.2671 0.9872 0.9864 0.9997 0.9120 2.0034 4.1914 2.0431 1.0696 3.8229 0.9799 0.9915 2.0288 1.0425
energy: -1704.931727872403
dipole: 28.50996 -27.84428 0.66568 -57.87697 58.60599 0.72902 26.15485 -22.05821 4.09664
magnitude: 4.21392 au
magnitude: 10.71092 debye
