program: Gaussian 09
title: 000032607
version: EM64L-G09RevD.01
frameworkgroup: C1[X(C11H15NO5)]
method: RPBEPBE
basis: SDD
operation: Freq
keyword: #p
keyword: freq=noraman
keyword: PBEPBE/SDD
title: #p freq=noraman PBEPBE/SDD
converged: YES YES NO NO
title: Mulliken charges:
elementType: O O O O O N C C C C C C C C C C C H H H H H H H H H H H H H H H
charge: -0.320378 -0.312799 -0.302935 -0.291028 -0.260315 -0.601825 0.021268 0.317895 0.273245 0.471157 -0.577601 -0.522597 -0.342661 -0.523256 -0.527036 -0.524695 0.156359 0.269094 0.275661 0.249559 0.246619 0.248545 0.234682 0.227277 0.257753 0.220938 0.229609 0.216070 0.264030 0.230082 0.336120 0.361163
chargesum: 0.00000
title: Mulliken charges with hydrogens summed into heavy atoms:
elementType: O O O O O N C C C C C C C C C C C
charge: -0.320378 -0.312799 -0.302935 -0.291028 -0.260315 0.095458 0.021268 0.317895 0.273245 0.471157 -0.308508 -0.246936 0.153517 0.187247 0.181264 0.185488 0.156359
polarizability: 2.02573717e+02 -3.35395343e+00 1.60047105e+02 1.01728648e+00 1.12055414e-02 8.51698734e+01
1716.lowfreq: -0.0006 -0.0003 0.0004 2.7232 4.5775 11.6036 33.1396 36.1372 59.4207
frequency: 32.7949 35.9584 59.1217 77.9050 79.5036 89.7230 95.4542 130.2332 139.0642 156.2783 165.9802 169.4976 201.4158 219.9016 224.1880 252.9157 267.2113 294.9552 328.4684 371.6179 423.5429 438.0224 496.3001 506.8912 518.8954 522.9641 585.5470 606.0271 631.0718 636.9506 654.5753 662.4264 729.1327 758.3688 840.3230 860.2147 870.3779 875.7597 895.6683 938.9287 974.3513 1002.0584 1018.8105 1040.0961 1073.6830 1111.4108 1112.8385 1115.4761 1116.9675 1148.8446 1155.4217 1159.8297 1174.3423 1201.3731 1203.3459 1301.8697 1340.0417 1354.8821 1371.4393 1402.8284 1418.3269 1437.4970 1442.1080 1448.5081 1456.6595 1458.5884 1460.9237 1466.6605 1474.6817 1485.2285 1487.4377 1570.8489 1575.0494 1610.4765 1654.1400 2974.9813 2976.0851 2977.3549 2982.6391 3046.7036 3075.6705 3077.2108 3084.2199 3118.9397 3124.4674 3129.1118 3182.3228 3183.8503 3510.2691 3671.5793
redmass: 6.2632 4.5060 3.1425 4.3557 3.6010 2.9860 3.1154 2.3773 1.6318 1.2949 1.6434 1.1045 4.0160 3.9610 4.2936 5.9273 7.5506 4.7092 4.8756 5.3564 5.8321 6.4155 3.9446 5.2027 1.8254 3.7287 6.2106 4.4288 2.6935 1.5036 3.7534 1.3851 5.6852 3.8092 1.5907 1.9496 4.8640 3.6550 7.6167 9.4942 8.5176 1.8430 3.0255 5.9690 1.8488 1.3858 1.3063 1.2420 2.4186 1.3987 1.3835 1.4590 2.6264 1.0819 1.4559 3.7499 1.5817 5.4398 4.3258 2.1150 1.2962 1.2390 1.6483 1.3483 1.0716 1.0848 1.0661 1.7742 1.0574 1.0553 1.0556 1.3686 7.7033 6.2783 5.8647 1.0312 1.0310 1.0325 1.0555 1.1062 1.1036 1.1042 1.0989 1.1031 1.1034 1.1045 1.0918 1.0921 1.0445 1.1047
irintensity: 0.1638 7.1261 3.8771 3.3227 0.5676 1.8280 9.5906 6.2790 1.6076 1.3574 1.5381 0.3199 15.0854 2.8230 15.7572 4.3100 3.6796 13.8715 2.4912 4.6583 13.8538 5.4849 0.1535 10.2214 34.4499 10.9722 2.7989 1.3406 19.8927 251.1731 11.4382 2.3677 20.4718 12.3777 6.4757 50.2553 6.2748 8.0672 27.6188 53.4885 23.3764 0.2165 188.5587 184.5743 24.4967 75.3674 38.3002 2.3111 110.9646 30.9800 46.1748 16.2270 111.4259 2.0046 30.6464 3.6243 20.3518 32.2485 106.7374 30.3887 34.7138 16.5014 21.0923 156.2453 5.0935 17.2845 2.1974 60.6179 2.5130 19.9383 27.3817 187.4116 148.6858 144.3693 344.8240 79.4327 77.1098 63.4041 20.7134 16.1362 25.1737 23.2206 29.6160 26.3309 21.0191 14.5211 0.4082 1.5570 40.9798 73.9033
temp: 298.150 k
press: 1.00000 atm
elementType: 8 8 8 8 8 7 6 6 6 6 6 6 6 6 6 6 6 1 1 1 1 1 1 1 1 1 1 1 1 1 1 1
symmnumber: 1
zpe: 656669.9 jmol-1
zpe.correction: 0.250112 hartree
zpe.thermalcorrener: 0.268794 hartree
zpe.thermalcorrenthalpy: 0.269738 hartree
zpe.thermalcorrgfe: 0.202121 hartree
zpe.sumelectzpe: -857.685101 hartree
zpe.sumelectthermal: -857.666419 hartree
zpe.sumelectthermalent: -857.665475 hartree
zpe.sumelectthermalfe: -857.733092 hartree
dipole: 4.2258 -2.1655 -0.9532
dipole: 4.8430
quadrupole: -106.7080 -95.2158 -97.7350
quadrupole: 15.5748 -0.4895 -0.2578
quadrupole: -6.8217 4.6705 2.1513 15.5748 -0.4895 -0.2578
hfenergy: -857.9352131 hartree
pointgroup: C01 [X(C11H15N1O5)]
dipole: 1.5868908 1.0265711 0.2417779 debye
polarizability: 201.8388622|6.7352343|157.6267381|2.8001883|-14.7786307|88.3250951 unknown
InChI: InChI=1S/C11H15NO5/c1-14-8-4-7(17-6-10(12)13)5-9(15-2)11(8)16-3/h4-5H,6,12H2,1-3H3
charge 0 multiplicity 1
32 atoms
O  -2.440383 0.130955 -0.054667
O  3.194948 -0.288427 0.172187
O  1.85969 2.222532 -0.349785
O  1.529043 -2.62719 0.618372
O  -5.67523 -1.519918 0.109878
N  -4.985542 0.670412 -0.341311
C  1.778768 -0.194203 0.180472
C  1.127179 1.049604 -0.06992
C  0.983677 -1.347815 0.41383
C  -1.045367 -0.041224 0.048519
C  -0.275284 1.127826 -0.146193
C  -0.429167 -1.275607 0.349491
C  -3.294314 -1.047814 0.134927
C  3.765245 -0.27625 -1.198586
C  2.787678 2.670181 0.715933
C  2.538205 -2.764342 1.694205
C  -4.76692 -0.65014 -0.033638
H  -0.754137 2.086858 -0.356676
H  -0.990339 -2.196113 0.525809
H  -3.056634 -1.830698 -0.61136
H  -3.163034 -1.472273 1.149243
H  3.501157 0.664946 -1.714212
H  3.392667 -1.144401 -1.772692
H  4.856035 -0.348204 -1.067561
H  3.522892 1.882671 0.95547
H  2.215768 2.944881 1.62261
H  3.288784 3.56011 0.305919
H  2.071114 -2.55653 2.676046
H  3.389088 -2.084415 1.52503
H  2.860255 -3.815695 1.648627
H  -5.940716 1.000628 -0.469208
H  -4.189225 1.301653 -0.436659
