program: Orca
programVersion: 4.2.1
elementType: Ru P N O C N C H C C H C H C C H H C C H H H C H H H C H H H C C H H H C H H H C H H H H C C H H H C H H H C H H H C H H O C H H C H H O H H
elementType: Ru
charge: 0
multiplicity: 1
keywords: PAL8
keywords: RKS wB97M-V def2-TZVPP def2-tzvpp/c def2/j tightscf rijcosx GRID6
keywords: CPCM
formula: C22H41N2O3PRu
InChI: InChI=1S/C21H40N2O2P.CO.Ru.H/c1-19(2,3)22-15-16-11-10-12-17(23-16)18(27-25-14-13-24)26(20(4,5)6)21(7,8)9;1-2;;/h10-12,18,22,24H,13-15H2,1-9H3;;;/q-1;;+1;
70 atoms
Ru 0.131041 -0.601361 -0.570239
P  -1.830646 0.440579 -0.073439
N  2.384474 -0.799337 -0.994112
O  -1.049183 -3.163125 -1.570084
C  1.999869 3.683774 0.752389
N  0.913573 1.301752 -0.020987
C  -1.193895 1.707027 1.058182
H  -1.879423 2.533603 1.254288
C  0.139245 2.1627 0.686376
C  0.693503 3.386238 1.080997
H  0.091577 4.08023 1.652184
C  2.763398 2.783744 0.014544
H  3.78671 2.999563 -0.259649
C  2.173718 1.593912 -0.368716
C  2.836466 0.58568 -1.259519
H  3.922824 0.683795 -1.208053
H  2.552387 0.819836 -2.288571
C  -2.624218 1.367292 -1.527259
C  -2.894635 0.42047 -2.694532
H  -1.986434 -0.092967 -3.010702
H  -3.26158 0.996484 -3.547629
H  -3.64485 -0.333713 -2.468999
C  -1.611738 2.415181 -1.993429
H  -1.446726 3.189863 -1.244575
H  -1.997811 2.905448 -2.889868
H  -0.647461 1.973779 -2.247244
C  -3.904317 2.100147 -1.139465
H  -4.727998 1.424445 -0.917085
H  -4.22351 2.730482 -1.973381
H  -3.756769 2.754956 -0.279392
C  -3.159848 -0.490307 0.887068
C  -2.442289 -1.485497 1.799912
H  -1.807617 -2.178586 1.245066
H  -3.190375 -2.078092 2.332888
H  -1.842773 -0.962417 2.543905
C  -3.986244 0.434194 1.779553
H  -3.359139 0.943459 2.511053
H  -4.709314 -0.166029 2.337562
H  -4.548126 1.182806 1.226275
C  -4.069121 -1.274405 -0.053511
H  -4.719457 -0.636748 -0.649454
H  -4.714896 -1.924954 0.540846
H  -3.502928 -1.914392 -0.731331
H  2.387638 -1.28847 -1.883071
C  3.276146 -1.600986 -0.077829
C  4.566304 -1.952314 -0.808414
H  4.361296 -2.543867 -1.702283
H  5.219981 -2.53938 -0.163818
H  5.121232 -1.063268 -1.109339
C  2.517047 -2.869752 0.272983
H  1.633575 -2.6458 0.873191
H  3.149353 -3.539711 0.856068
H  2.200518 -3.40259 -0.625475
C  3.572057 -0.801724 1.17649
H  4.181025 0.079209 0.970441
H  4.123192 -1.420616 1.882884
H  2.654217 -0.486247 1.671354
C  -0.588821 -2.177588 -1.146754
H  2.43292 4.624552 1.069105
H  0.017368 -0.136704 -2.063705
O  -0.635383 0.697691 3.417981
C  0.408755 -0.11188 3.102668
H  1.392356 0.40858 3.097623
H  0.327578 -0.536485 2.053992
C  0.504878 -1.295612 4.042415
H  -0.450831 -1.836346 4.038103
H  0.66137 -0.927429 5.064871
O  1.57424 -2.139897 3.633368
H  1.618159 -2.87819 4.248495
H  -1.004864 1.193115 2.238863
elementType: Ru P N O C H
totalener: -1634.42849011 hartree
nucrepener: 3830.38755280 hartree
electener: -5464.81604291 hartree
oneelecener: -9893.00967216 hartree
twoeener: 4428.19362924 hartree
cpcmener: -0.02681641 hartree
kineticenergy: 1569.34859187 hartree
exchangeener: -138.792742690768 hartree
correlationener: -7.769161757375 hartree
xcener: -145.703722345432 hartree
chargesum: -0.0000000
charge: -0.018814 0.361725 -0.213249 -0.229509 -0.104682 -0.104663 -0.331309 0.134385 0.117104 -0.220553 0.136953 -0.186508 0.144395 0.130740 -0.145402 0.155276 0.154526 0.023108 -0.378427 0.136415 0.130207 0.137085 -0.417068 0.136984 0.135408 0.146848 -0.417322 0.129668 0.131763 0.137226 0.032939 -0.428329 0.138754 0.134236 0.125722 -0.379077 0.130802 0.124648 0.137243 -0.421905 0.131667 0.132036 0.141572 0.159570 0.128793 -0.331960 0.122276 0.122872 0.117748 -0.366322 0.113722 0.124699 0.136646 -0.320179 0.130711 0.124736 0.081292 0.026797 0.157270 -0.042928 -0.597185 0.047738 0.089604 -0.036845 -0.071475 0.088747 0.104579 -0.335342 0.171501 0.240314
charge: -0.218885 0.901192 0.323210 0.170188 0.018624 0.239223 -0.168804 -0.000182 -0.155913 -0.009318 0.029535 -0.021093 0.027628 -0.142472 -0.029343 0.030065 0.044609 -0.276499 0.000025 0.015996 0.017640 0.011731 0.003001 0.018027 0.017844 0.015828 -0.002686 0.009598 0.019902 0.014779 -0.278318 0.000271 0.015281 0.015772 0.011400 0.002940 0.017439 0.018991 0.009841 -0.000667 0.009049 0.020353 0.018043 -0.011261 -0.222078 0.020327 0.018055 0.023064 0.014045 0.022351 0.017949 0.023232 0.020780 0.027652 0.017031 0.024891 0.018462 -0.315532 0.034934 -0.049017 -0.041367 -0.277787 -0.007799 0.002231 -0.133886 -0.003072 -0.002061 0.255017 -0.137074 -0.102932
qa: -0.0188 0.3617 -0.2132 -0.2295 -0.1047 -0.1047 -0.3313 0.1344 0.1171 -0.2206 0.1370 -0.1865 0.1444 0.1307 -0.1454 0.1553 0.1545 0.0231 -0.3784 0.1364 0.1302 0.1371 -0.4171 0.1370 0.1354 0.1468 -0.4173 0.1297 0.1318 0.1372 0.0329 -0.4283 0.1388 0.1342 0.1257 -0.3791 0.1308 0.1246 0.1372 -0.4219 0.1317 0.1320 0.1416 0.1596 0.1288 -0.3320 0.1223 0.1229 0.1177 -0.3663 0.1137 0.1247 0.1366 -0.3202 0.1307 0.1247 0.0813 0.0268 0.1573 -0.0429 -0.5972 0.0477 0.0896 -0.0368 -0.0715 0.0887 0.1046 -0.3353 0.1715 0.2403
va: 4.8078 4.0220 3.1112 2.2879 3.9331 3.0379 3.4459 0.9998 3.7206 3.9564 1.0010 3.9119 0.9958 3.7569 3.7834 0.9772 0.9843 3.8822 3.7836 0.9899 0.9912 0.9812 3.7817 0.9789 0.9957 0.9938 3.8105 0.9831 0.9973 0.9799 3.8413 3.6623 0.9855 0.9962 1.0747 3.7901 1.0025 0.9929 0.9818 3.7942 0.9827 0.9987 0.9852 1.0012 3.9285 3.8401 0.9913 0.9928 0.9940 3.8237 0.9878 1.0002 0.9909 3.7834 0.9884 1.0082 1.0217 3.5682 0.9853 1.0414 1.7650 3.9648 0.9679 0.9176 3.9276 0.9764 0.9776 2.0069 1.0476 1.0764
energy: -1634.428490113630
dipole: -17.00880 19.22798 2.21918 38.15065 -37.35542 0.79523 53.97969 -56.27642 -2.29673
magnitude: 3.29122 au
magnitude: 8.36561 debye
