program: Orca
programVersion: 4.2.1
elementType: Ru P N O C N C H C C H C H C C H H C C H H H C H H H C H H H C C H H H C H H H C H H H H C C H H H C H H H C H H H C H H H H H H O O O H H O H H H H O H H O H H O H H O H H
elementType: Ru
charge: 0
multiplicity: 1
keywords: PAL8
keywords: RKS wB97M-V def2-TZVPP def2-tzvpp/c def2/j tightscf rijcosx GRID6
keywords: CPCM
formula: C20H53N2O9PRu
InChI: InChI=1S/C19H34N2P.CO.8H2O.Ru.3H/c1-17(2,3)20-13-15-11-10-12-16(21-15)14-22(18(4,5)6)19(7,8)9;1-2;;;;;;;;;;;;/h10-12H,13-14H2,1-9H3;;8*1H2;;;;/q-2;;;;;;;;;;+2;;;
86 atoms
Ru 0.035585 -1.249991 -0.083619
P  -0.063759 1.042112 0.225063
N  -0.540565 -3.369839 0.095781
O  1.9507 -1.23266 -2.378203
C  -3.535455 -1.244802 3.246877
N  -1.539951 -1.168463 1.384198
C  -1.758498 1.195943 0.958672
H  -1.878164 2.095642 1.564632
C  -2.171135 -0.028623 1.707948
C  -3.179656 -0.041173 2.659224
H  -3.682009 0.879764 2.921895
C  -2.886127 -2.411682 2.879557
H  -3.151904 -3.364649 3.316958
C  -1.875565 -2.344301 1.933983
C  -1.040852 -3.498176 1.466054
H  -1.583353 -4.43208 1.637895
H  -0.16874 -3.541031 2.136819
C  1.063958 1.746405 1.571823
C  2.522151 1.428763 1.244228
H  2.683415 0.364462 1.068654
H  3.150816 1.719677 2.088364
H  2.882007 1.967642 0.370127
C  0.686262 1.030409 2.871735
H  -0.302404 1.320224 3.228835
H  1.40218 1.306788 3.647923
H  0.710259 -0.056183 2.78058
C  0.912352 3.245981 1.801989
H  1.284889 3.837357 0.967341
H  1.495526 3.529448 2.681303
H  -0.121119 3.534677 1.99645
C  -0.141587 2.203834 -1.257581
C  -0.872793 1.477515 -2.387276
H  -0.327388 0.603593 -2.737453
H  -0.98186 2.165253 -3.228594
H  -1.87295 1.152512 -2.098083
C  -0.900949 3.499322 -0.972123
H  -1.939299 3.315694 -0.697767
H  -0.915522 4.101314 -1.883253
H  -0.446587 4.105949 -0.194597
C  1.274408 2.523437 -1.729879
H  1.801865 3.183933 -1.043429
H  1.22446 3.032876 -2.694343
H  1.874207 1.622835 -1.867926
H  0.722258 -4.026441 0.142994
C  -1.401438 -4.025465 -0.922618
C  -1.397196 -5.543684 -0.702772
H  -0.382221 -5.940354 -0.748011
H  -1.987301 -6.040922 -1.473472
H  -1.825764 -5.828911 0.25786
C  -0.792974 -3.760082 -2.293758
H  -0.880603 -2.711366 -2.575051
H  -1.295312 -4.357142 -3.055894
H  0.266326 -4.025724 -2.306173
C  -2.841185 -3.51952 -0.892671
H  -3.337497 -3.769375 0.047381
H  -3.429464 -3.969412 -1.694581
H  -2.876425 -2.435855 -1.018302
C  1.215727 -1.251538 -1.466156
H  -4.326415 -1.272104 3.985586
H  -1.149932 -0.987262 -1.116136
H  1.379628 -2.062328 1.059941
H  1.445333 -1.276527 1.21959
H  -2.435924 1.310367 0.106339
H  2.333851 -4.026866 -0.287048
O  1.725256 -4.488591 0.310765
O  4.907856 -5.668357 -1.32977
O  4.078166 -6.263433 2.718515
H  3.574172 -5.443884 2.894023
H  4.530698 -4.781058 -1.49455
O  5.941944 -4.889881 1.206214
H  5.750289 -5.235072 0.317194
H  5.373035 -5.432786 1.798849
H  5.384202 -5.906419 -2.131053
H  2.322028 -6.155003 0.26386
O  2.865673 -6.975519 0.271754
H  3.570049 -6.758153 -0.357974
H  3.627308 -6.639728 1.934404
O  2.719916 -3.782098 2.768857
H  3.412321 -3.164953 2.484791
H  2.302685 -4.032987 1.909484
O  3.834994 -3.147597 -1.216936
H  3.426179 -2.472183 -1.771871
H  4.178395 -2.693888 -0.419282
O  4.810975 -2.460083 1.26126
H  5.445813 -1.7656 1.462835
H  5.321416 -3.313738 1.283004
elementType: Ru P N O C H
totalener: -2016.97741780 hartree
nucrepener: 4871.87182873 hartree
electener: -6888.84924653 hartree
twoeener: 5611.95582193 hartree
cpcmener: -0.03598922 hartree
kineticenergy: 1950.65127154 hartree
exchangeener: -169.384090523709 hartree
correlationener: -9.428685674788 hartree
xcener: -177.761751099239 hartree
chargesum: -0.0000000
charge: -0.158342 0.399639 -0.401636 -0.267582 -0.092850 -0.019670 -0.264428 0.171217 0.093535 -0.176849 0.149478 -0.173302 0.149616 0.131338 -0.138473 0.138407 0.143827 -0.031954 -0.352830 0.112066 0.134595 0.143451 -0.389012 0.139001 0.142574 0.141231 -0.407559 0.132274 0.138902 0.136968 -0.024027 -0.387840 0.143258 0.135918 0.140845 -0.357424 0.127625 0.132054 0.142811 -0.419319 0.132655 0.135468 0.149466 0.305093 0.155221 -0.353415 0.114280 0.117243 0.108138 -0.398605 0.119595 0.129362 0.123704 -0.393358 0.116871 0.125079 0.139375 0.038545 0.159634 -0.100334 0.000070 0.052534 0.179034 0.208928 -0.629635 -0.446885 -0.504922 0.233387 0.251186 -0.500316 0.229591 0.238529 0.219266 0.259469 -0.514493 0.224061 0.233424 -0.494427 0.222025 0.239164 -0.470293 0.237125 0.247679 -0.458136 0.214567 0.247519
charge: -0.341633 0.919423 0.162235 0.170014 0.028163 0.259406 -0.115009 0.026171 -0.149077 -0.000899 0.033257 0.001132 0.033852 -0.124309 -0.095376 0.027529 0.034100 -0.284221 0.002767 0.011262 0.022085 0.015031 0.008158 0.020372 0.023493 0.014945 0.001062 0.012278 0.023421 0.015153 -0.283243 -0.000973 0.019379 0.020210 0.016106 0.007113 0.016231 0.022725 0.011768 0.003493 0.011802 0.023618 0.019397 -0.202528 -0.261070 0.011586 0.011406 0.013983 0.006151 0.011525 0.013574 0.014827 0.016279 0.012753 0.014157 0.015503 0.014399 -0.311278 0.036737 -0.058108 0.091386 0.076111 0.035882 -0.205242 0.247581 0.334013 0.266153 -0.175470 -0.171566 0.302719 -0.174343 -0.174332 -0.121299 -0.190032 0.260452 -0.173039 -0.175520 0.259462 -0.171824 -0.192508 0.353864 -0.150056 -0.170485 0.323225 -0.127931 -0.179509
qa: -0.1583 0.3996 -0.4016 -0.2676 -0.0929 -0.0197 -0.2644 0.1712 0.0935 -0.1768 0.1495 -0.1733 0.1496 0.1313 -0.1385 0.1384 0.1438 -0.0320 -0.3528 0.1121 0.1346 0.1435 -0.3890 0.1390 0.1426 0.1412 -0.4076 0.1323 0.1389 0.1370 -0.0240 -0.3878 0.1433 0.1359 0.1408 -0.3574 0.1276 0.1321 0.1428 -0.4193 0.1327 0.1355 0.1495 0.3051 0.1552 -0.3534 0.1143 0.1172 0.1081 -0.3986 0.1196 0.1294 0.1237 -0.3934 0.1169 0.1251 0.1394 0.0385 0.1596 -0.1003 0.0001 0.0525 0.1790 0.2089 -0.6296 -0.4469 -0.5049 0.2334 0.2512 -0.5003 0.2296 0.2385 0.2193 0.2595 -0.5145 0.2241 0.2334 -0.4944 0.2220 0.2392 -0.4703 0.2371 0.2477 -0.4581 0.2146 0.2475
va: 5.4063 3.9261 2.7621 2.2161 3.9158 3.1329 3.7909 0.9809 3.8497 3.9453 0.9954 3.9514 0.9950 3.7350 3.6972 0.9835 0.9903 3.9514 3.7936 1.0026 0.9925 0.9822 3.7733 0.9784 0.9946 0.9940 3.8022 0.9836 0.9958 0.9810 3.9010 3.8043 0.9802 0.9940 0.9832 3.7895 0.9897 0.9921 0.9818 3.8126 0.9834 0.9963 0.9789 0.9961 3.9276 3.8073 1.0089 0.9947 0.9941 3.7691 0.9885 0.9980 0.9982 3.7905 0.9843 0.9971 0.9838 3.5169 0.9854 1.0100 1.0558 1.0058 0.9779 1.0656 1.8073 2.0425 2.0149 1.0793 1.0386 1.9944 1.0718 1.0861 1.0209 1.0508 1.9963 1.0666 1.0810 1.9967 1.0649 1.0764 2.0164 1.0405 1.0533 2.0066 1.0236 1.0614
energy: -2016.977417796508
dipole: 46.27428 -49.73599 -3.46171 -24.15675 31.20395 7.04720 24.73661 -25.13191 -0.39530
magnitude: 7.86147 au
magnitude: 19.98228 debye
