program: Gaussian 09
title: 000032570
version: EM64L-G09RevD.01
frameworkgroup: C1[X(C18H27N)]
method: RPBEPBE
basis: SDD
operation: Freq
keyword: #pfreq=noraman
keyword: PBEPBE/SDD
title: #p freq=noraman PBEPBE/SDD
converged: YES YES NO NO
title: Mulliken charges:
elementType: N C C C C C C C C C C C C C C C C C C H H H H H H H H H H H H H H H H H H H H H H H H H H H
charge: -0.377267 0.281070 0.362028 -0.207118 -0.106915 -0.538482 -0.524137 -0.480113 -0.827586 -0.798647 -0.794274 -0.499628 0.434566 -0.448386 -0.381858 -0.390279 -0.379272 0.434372 -0.808961 0.236713 0.225453 0.235441 0.219554 0.229527 0.211290 0.228123 0.203504 0.205715 0.226852 0.214363 0.209607 0.237967 0.212999 0.211376 0.237365 0.211843 0.244600 0.228749 0.193456 0.229905 0.263407 0.226433 0.226094 0.233539 0.222979 0.224033
chargesum: 0.00000
title: Mulliken charges with hydrogens summed into heavy atoms:
elementType: N C C C C C C C C C C C C C C C C C C
charge: -0.132667 0.281070 0.362028 0.029595 0.118539 -0.083487 -0.083320 -0.048486 -0.180656 -0.138074 -0.133690 -0.077423 0.434566 -0.218481 -0.118451 -0.163846 -0.153179 0.434372 -0.128409
polarizability: 2.57032775e+02 5.14468652e+00 1.83461547e+02 9.11182439e+00 -2.87965643e-01 1.45738731e+02
1716.lowfreq: -32.7989 -17.4908 -9.1562 -4.2650 0.0003 0.0005 0.0007 18.6197 25.1485
frequency: -32.5548 14.2375 24.8216 37.6200 87.3751 99.3028 129.9703 157.5356 177.3634 190.0414 198.7101 212.9804 231.1364 251.7813 264.8471 296.4648 321.1129 336.2092 349.2417 375.9206 399.0255 407.5970 421.5996 451.2185 476.3285 489.0856 511.6081 557.2194 573.5093 586.4590 635.0688 639.6519 692.9283 720.1422 730.7466 738.9289 783.9592 812.3323 819.3792 828.6669 839.8698 855.7981 883.8693 911.4876 932.4043 941.0999 942.9488 947.0087 956.2545 970.2575 975.7252 981.3380 988.9040 993.7185 1013.8613 1031.3343 1042.5516 1046.7390 1073.5933 1083.0218 1101.1518 1116.9555 1128.9100 1143.2889 1154.4153 1168.6180 1183.7446 1197.8676 1199.5178 1209.9683 1218.5911 1221.1939 1222.7660 1233.8244 1250.0844 1266.3918 1274.2837 1294.3417 1299.7921 1302.3087 1315.5347 1333.5369 1357.5676 1377.6475 1384.2582 1384.7971 1395.7433 1396.2389 1405.4981 1442.9797 1455.7246 1459.2903 1469.5969 1471.8046 1473.0734 1473.1997 1476.7402 1481.0285 1483.0820 1486.0115 1491.0627 1499.9295 1508.7246 1584.7863 1626.2630 2849.2202 2854.2833 2962.3830 2971.7682 2972.6898 2976.4458 2979.6533 2997.6773 3001.3273 3010.5355 3042.5358 3043.5722 3049.4167 3051.6907 3053.3536 3056.6345 3060.9325 3062.3319 3076.8460 3082.0794 3088.5625 3092.3918 3108.0515 3115.4141 3132.8780 3150.9667 3411.6525
redmass: 1.0264 3.6824 3.4536 3.7388 3.0279 2.5105 1.8137 2.3655 1.8977 1.1317 1.1563 2.8089 2.4416 2.3401 2.7943 2.6669 2.2201 2.5068 2.4196 2.7517 2.7467 2.8595 2.0793 2.8387 3.4032 2.5697 2.8231 3.9063 3.6830 3.2736 4.3509 4.7080 1.5950 2.6977 2.3095 2.9597 2.4704 1.6088 1.8165 2.2432 2.4728 1.2502 2.3423 2.2536 1.6454 1.6872 1.4456 1.3841 1.8889 1.6137 2.3118 1.4506 1.4102 1.5183 2.8150 1.7749 2.1181 1.5609 1.5715 1.4724 1.6545 1.3474 2.3602 2.3951 1.9101 2.1861 1.1283 1.5663 1.5293 1.7639 3.2678 2.2321 1.8325 1.8383 1.6454 1.7697 1.5184 1.4841 1.3957 1.6246 1.7186 1.4957 1.7199 1.2600 1.3209 2.3073 1.2266 1.1984 2.7030 1.2212 1.0718 1.0667 1.0630 1.0730 1.0715 1.0569 1.0628 1.0657 1.0993 1.0687 1.0644 1.0652 2.6469 6.1189 6.4584 1.0760 1.0782 1.0364 1.0379 1.0385 1.0379 1.0845 1.0603 1.0608 1.0634 1.0934 1.0922 1.0992 1.1029 1.0950 1.0977 1.0994 1.1024 1.1027 1.0997 1.0964 1.0959 1.0869 1.0888 1.0963 1.0952 1.0737
irintensity: 0.5070 0.1834 0.0400 0.0737 0.8054 0.1437 2.5320 1.1844 0.2643 0.1027 0.0629 0.4640 0.4352 0.0638 0.0937 0.1710 0.9625 0.3582 0.3921 1.1988 1.7140 0.3769 0.4296 5.9256 1.8375 14.7953 5.1921 5.2186 0.8710 2.4835 1.4298 1.7581 48.6017 8.8563 6.8117 1.5750 7.3534 29.8824 7.2156 6.4872 9.3482 1.0237 0.0713 1.0681 2.9645 3.3158 4.8364 1.6833 1.0349 5.6996 2.5449 1.0400 1.1717 3.8085 10.0229 1.4936 7.1072 17.7507 4.8465 7.8375 7.6026 10.1311 28.8259 30.5294 5.0357 5.3642 7.6509 6.1102 15.2954 10.5542 5.7913 0.7142 1.0822 1.7911 2.8988 0.2938 2.1660 0.4272 3.1661 2.0975 4.0836 24.7595 16.7674 11.9706 10.8526 2.7638 7.8704 34.3853 1.6450 30.2758 2.8964 0.0616 21.7519 13.9544 19.3363 6.9005 4.7282 6.1926 10.1824 11.7166 12.1331 5.1534 34.3243 0.1844 0.4926 28.8559 142.0760 33.9236 22.8337 44.6239 62.6500 19.3520 37.2905 31.2742 62.6288 21.6514 71.5291 1.4541 13.1298 25.2572 66.0378 20.4695 40.2138 65.1915 18.9433 50.8161 26.3110 14.0617 22.2016 31.6118 6.1925 0.7881
temp: 298.150 k
press: 1.00000 atm
elementType: 7 6 6 6 6 6 6 6 6 6 6 6 6 6 6 6 6 6 6 1 1 1 1 1 1 1 1 1 1 1 1 1 1 1 1 1 1 1 1 1 1 1 1 1 1 1
symmnumber: 1
zpe: 1065402.2 jmol-1
zpe.correction: 0.405790 hartree
zpe.thermalcorrener: 0.424445 hartree
zpe.thermalcorrenthalpy: 0.425389 hartree
zpe.thermalcorrgfe: 0.358186 hartree
zpe.sumelectzpe: -755.396388 hartree
zpe.sumelectthermal: -755.377733 hartree
zpe.sumelectthermalent: -755.376789 hartree
zpe.sumelectthermalfe: -755.443992 hartree
dipole: -0.1422 -0.6443 0.5071
dipole: 0.8321
quadrupole: -109.4107 -113.5578 -119.0182
quadrupole: 0.9123 2.0151 0.0856
quadrupole: 4.5849 0.4377 -5.0226 0.9123 2.0151 0.0856
hfenergy: -755.8021781 hartree
pointgroup: C01 [X(C18H27N1)]
dipole: 0.0610596 0.320409 0.028163 debye
polarizability: 256.7780203|-2.1006644|172.5178744|-11.6640625|-16.9609831|156.937158 unknown
InChI: InChI=1S/C18H27N/c1-13-5-7-14(8-6-13)12-19-16-11-15-9-10-18(16,4)17(15,2)3/h5-8,15-16,19H,9-12H2,1-4H3
charge 0 multiplicity 1
46 atoms
N  0.042035 0.300092 -0.020801
C  2.495248 0.380368 0.67494
C  3.822876 0.105631 -0.155975
C  3.220751 -1.166651 -0.856347
C  1.438112 0.487174 -0.481466
C  2.262761 -0.99774 1.382855
C  1.90707 -0.619848 -1.496585
C  2.80265 -2.052605 0.353041
C  2.507678 1.581627 1.627437
C  5.05984 -0.184298 0.72928
C  4.230676 1.232407 -1.139692
C  -0.977912 0.627272 -1.04515
C  -2.394814 0.389643 -0.538488
C  -3.437665 1.296564 -0.847123
C  -2.710067 -0.761435 0.227489
C  -4.76129 1.05535 -0.414123
C  -4.031639 -0.997923 0.661696
C  -5.082193 -0.094735 0.350402
C  -6.498294 -0.339403 0.844546
H  3.892542 -1.669936 -1.573776
H  1.549627 1.49545 -0.952701
H  1.190055 -1.144825 1.592639
H  2.807511 -1.039983 2.343742
H  2.080229 -0.206719 -2.506399
H  1.144705 -1.415242 -1.58041
H  3.661794 -2.617389 0.757883
H  2.029847 -2.787543 0.065445
H  1.557856 1.665009 2.191588
H  3.315979 1.488757 2.376833
H  2.653994 2.533661 1.082228
H  5.429905 0.749134 1.194641
H  4.860399 -0.904278 1.539827
H  5.882917 -0.592903 0.112365
H  5.153248 0.944291 -1.678932
H  3.463853 1.459449 -1.897942
H  4.450575 2.168668 -0.591582
H  -0.140783 0.828294 0.845734
H  -0.782564 -0.02268 -1.92247
H  -0.893897 1.679743 -1.41808
H  -3.215178 2.19693 -1.434142
H  -1.904466 -1.460403 0.477161
H  -5.553384 1.770488 -0.669455
H  -4.255018 -1.897916 1.248824
H  -6.642307 0.069913 1.863749
H  -7.245138 0.142406 0.189082
H  -6.730026 -1.418467 0.890811
