program: Gaussian 09
title: 000032614
version: EM64L-G09RevD.01
frameworkgroup: C1[X(C9H10Cl6N4)]
method: RPBEPBE
basis: SDD
operation: Freq
keyword: #p
keyword: freq=noraman
keyword: PBEPBE/SDD
title: #p freq=noraman PBEPBE/SDD
converged: YES YES NO NO
title: Mulliken charges:
elementType: Cl Cl Cl Cl Cl Cl N N N N C C C C C C C C C H H H H H H H H H H
charge: 0.121266 0.130310 0.113910 0.127322 0.125158 0.110076 -0.324469 -0.036001 -0.026157 0.072114 -0.035429 -0.380605 -0.685782 -0.691660 0.034381 0.300972 0.284045 -0.780525 -0.778902 0.192944 0.226483 0.257351 0.218905 0.219513 0.221405 0.215207 0.223707 0.212815 0.331647
chargesum: 0.00000
title: Mulliken charges with hydrogens summed into heavy atoms:
elementType: Cl Cl Cl Cl Cl Cl N N N N C C C C C C C C C
charge: 0.121266 0.130310 0.113910 0.127322 0.125158 0.110076 0.007178 -0.036001 -0.026157 0.072114 0.157515 0.103230 -0.025959 -0.039931 0.034381 0.300972 0.284045 -0.780525 -0.778902
polarizability: 2.28843852e+02 1.98570013e+01 1.93011581e+02 6.21466047e+00 4.79057897e+00 1.49276434e+02
1716.lowfreq: -8.4260 -7.0824 -3.3841 -0.0017 0.0019 0.0021 6.5459 8.3611 18.7170
frequency: 5.0174 6.9448 18.5217 32.8484 47.1989 63.2281 78.5973 106.4178 124.1907 150.8010 165.6295 178.1377 188.2195 198.0831 208.4618 222.8872 226.5225 247.4610 252.5914 274.2326 282.9343 295.1225 311.1419 329.3167 369.0367 379.0791 404.5454 409.9852 434.6245 557.4407 606.3287 609.2322 636.9683 660.3332 666.9003 736.7027 751.1516 768.6287 772.6968 783.9023 812.2060 836.2572 895.7318 903.3839 913.9462 932.5000 961.4493 978.7834 1012.4292 1099.1259 1133.5437 1144.1742 1178.7275 1187.3748 1259.5216 1290.9449 1296.7214 1330.6962 1338.8903 1350.5343 1380.1155 1384.8024 1399.6985 1456.7667 1463.6972 1468.1080 1472.7038 1482.2337 1487.0451 1499.6317 1590.4774 2956.4755 2974.1012 2978.5285 2994.0033 3065.8283 3075.1129 3076.9986 3081.6959 3086.5458 3534.0548
redmass: 16.4236 31.7132 3.4100 4.0312 3.3768 12.1127 22.5917 14.7075 4.3614 12.9718 5.3349 27.4679 1.5155 2.7645 11.0147 13.3414 1.2157 5.6622 17.3558 7.1869 7.9475 7.2197 13.6634 4.6914 5.8794 21.4581 5.8021 1.8832 5.5329 4.2125 12.5880 6.1186 2.7789 7.0285 2.1981 10.4227 9.4145 11.7037 11.1877 8.8136 2.6929 11.8840 5.4844 1.7310 1.2851 1.8658 1.5228 5.3562 5.7968 3.2829 2.2581 3.1596 1.8394 4.0520 1.3750 2.1572 2.5073 4.3683 1.4382 1.4530 1.2182 2.7743 1.2592 1.4258 1.4505 1.0936 1.2915 1.0520 1.0548 4.1649 5.5894 1.0838 1.0359 1.0361 1.0646 1.1000 1.0996 1.0998 1.0991 1.0986 1.0765
irintensity: 0.0313 0.0093 0.0885 0.0121 0.0491 0.0646 0.0401 0.2593 1.3112 1.0788 1.9829 0.1068 0.8045 1.4028 0.5134 0.1528 0.2530 0.3082 0.2099 0.4107 0.8487 0.7326 1.1414 1.0081 0.6561 0.1939 0.1488 1.1719 1.2416 27.6445 1.1873 15.6921 220.3184 85.8916 28.4127 175.2023 194.4774 4.7306 65.0471 11.1640 9.7738 1.3024 30.5083 4.0842 5.1314 5.2051 2.0918 53.4190 28.3494 4.6690 12.5144 27.9767 3.3992 32.7895 20.4364 40.9347 18.7180 1.2922 9.7987 4.6698 11.3043 163.4427 6.4994 56.1583 76.2264 18.0056 40.0158 14.0670 38.2704 234.1370 703.7891 29.6615 34.5327 15.3101 45.0614 28.5397 27.2588 23.3641 59.7388 20.8807 74.4804
temp: 298.150 k
press: 1.00000 atm
elementType: 17 17 17 17 17 17 7 7 7 7 6 6 6 6 6 6 6 6 6 1 1 1 1 1 1 1 1 1 1
symmnumber: 1
zpe: 492428.6 jmol-1
zpe.correction: 0.187556 hartree
zpe.thermalcorrener: 0.209136 hartree
zpe.thermalcorrenthalpy: 0.210080 hartree
zpe.thermalcorrgfe: 0.130160 hartree
zpe.sumelectzpe: -3326.858473 hartree
zpe.sumelectthermal: -3326.836894 hartree
zpe.sumelectthermalent: -3326.835950 hartree
zpe.sumelectthermalfe: -3326.915870 hartree
dipole: -5.1748 -3.9000 -0.8440
dipole: 6.5346
quadrupole: -147.8373 -151.6942 -150.8908
quadrupole: 12.2947 1.2381 1.5631
quadrupole: 2.3035 -1.5535 -0.7500 12.2947 1.2381 1.5631
hfenergy: -3327.0460293 hartree
pointgroup: C01 [X(C9H10Cl6N4)]
dipole: -2.4131748 0.609818 0.6436205 debye
polarizability: 236.2996303|-0.4792926|180.9269512|-12.8206035|10.7253891|153.9052846 unknown
InChI: InChI=1S/C9H10Cl6N4/c1-4(2)3-16-7-18-5(8(10,11)12)17-6(19-7)9(13,14)15/h4,16H,3H2,1-2H3
charge 0 multiplicity 1
29 atoms
Cl 3.282384 2.093001 -1.521425
Cl 2.124017 3.71024 0.741596
Cl 3.839215 1.305144 1.355862
Cl 2.220818 -3.19699 0.043568
Cl -0.707506 -3.552072 -0.558785
Cl 1.102943 -2.31672 -2.636208
N  -2.080878 1.027919 1.029161
N  -0.730373 -0.699467 0.139784
N  0.167176 1.522896 0.624066
N  1.599328 -0.203133 -0.284323
C  -4.404961 0.737011 0.082355
C  -3.312571 0.218978 1.058331
C  -3.932661 0.662259 -1.386748
C  -5.703572 -0.073682 0.302245
C  -0.870718 0.60045 0.586819
C  0.512432 -1.025915 -0.270014
C  1.350603 1.058893 0.179467
C  2.559934 2.004232 0.191089
C  0.750878 -2.445496 -0.805846
H  -4.614945 1.799642 0.332394
H  -3.707726 0.219343 2.092995
H  -3.030515 -0.814605 0.796854
H  -3.724637 -0.38463 -1.677172
H  -4.708271 1.058177 -2.066954
H  -3.010413 1.249061 -1.549768
H  -5.539959 -1.146255 0.084338
H  -6.504925 0.285364 -0.367808
H  -6.068172 0.01164 1.343204
H  -2.110526 2.003116 1.339324
