program: Orca
programVersion: 4.2.1
elementType: Ru P O N C C C H C H C H C C C C H H H C H H H C H H H C C H H H C H H H C H H H C C C C H C H H H N H H O H O H H O O H H O H H O H H O H H O H H H C H H C H H O H O H H H
elementType: Ru
charge: 0
multiplicity: 1
keywords: PAL8
keywords: RKS wB97M-V def2-TZVPP def2-tzvpp/c def2/j tightscf rijcosx GRID6
keywords: CPCM
formula: C22H49N2O11PRu
InChI: InChI=1S/C19H27N2P.C2H5O2.CO.8H2O.Ru.H/c1-18(2,3)22(19(4,5)6)14-15-10-9-12-17(21-15)16-11-7-8-13-20-16;3-1-2-4;1-2;;;;;;;;;;/h7-13H,14H2,1-6H3;3H,1-2H2;;8*1H2;;/q-2;-1;;;;;;;;;;+3;
86 atoms
Ru -0.019983 -1.75685 -2.01721
P  -2.187302 -1.962464 -1.343859
O  -0.03665 -3.963409 -4.033321
N  -0.014011 -0.16467 -0.595958
C  -2.108254 -1.026377 0.249651
C  -1.030326 0.006394 0.2634
C  -1.012044 1.056509 1.171088
H  -1.839389 1.187993 1.854647
C  0.084605 1.899633 1.205654
H  0.121808 2.716253 1.914501
C  1.147198 1.678666 0.348507
H  2.022966 2.309814 0.38931
C  1.076519 0.625125 -0.552476
C  -0.030576 -3.107225 -3.240718
C  -3.454173 -0.986952 -2.355097
C  -3.406371 -1.43484 -3.814427
H  -4.095856 -0.822614 -4.400096
H  -2.410512 -1.311489 -4.237765
H  -3.70324 -2.47377 -3.94673
C  -4.882262 -1.102924 -1.831135
H  -5.518149 -0.412127 -2.389914
H  -5.301267 -2.098556 -1.962681
H  -4.963678 -0.830837 -0.778084
C  -3.053356 0.488359 -2.283535
H  -3.192872 0.90537 -1.285553
H  -2.019714 0.652256 -2.586175
H  -3.691298 1.05987 -2.960816
C  -2.918723 -3.620792 -0.819528
C  -3.458646 -4.360715 -2.040333
H  -4.371104 -3.915825 -2.43381
H  -2.725598 -4.407023 -2.846872
H  -3.696197 -5.388977 -1.758675
C  -4.00118 -3.515787 0.252774
H  -4.32495 -4.524813 0.519141
H  -3.631012 -3.052395 1.166957
H  -4.883744 -2.971762 -0.07043
C  -1.761529 -4.435602 -0.24589
H  -0.999712 -4.627737 -0.999243
H  -1.273369 -3.939771 0.594023
H  -2.144106 -5.397224 0.104618
C  2.14125 0.27262 -1.495858
C  3.336204 0.97744 -1.581624
C  2.817507 -1.129669 -3.210875
C  4.286353 0.60657 -2.512313
H  3.517469 1.81033 -0.917653
C  4.017065 -0.461816 -3.351932
H  2.570083 -1.973667 -3.841467
H  5.22083 1.146659 -2.583421
H  4.723666 -0.784648 -4.103278
N  1.899358 -0.792032 -2.299435
H  -0.575002 -0.800096 -3.183731
H  -3.07076 -0.605008 0.544157
O  0.927721 -2.750151 -0.242168
H  -1.844963 -1.762353 1.017405
O  2.593975 1.214241 3.542874
H  2.72296 0.672925 2.739748
H  3.114734 0.718359 4.205132
O  1.761809 -3.778021 4.049425
O  3.877871 -0.630565 5.273561
H  4.18012 -1.298483 4.637159
H  3.084549 -1.034904 5.664055
O  2.809676 -0.787326 1.566802
H  1.921453 -1.176913 1.672456
H  3.375874 -1.415896 2.053952
O  0.218609 -0.163544 4.107839
H  0.154053 -0.751167 3.32989
H  0.970411 0.432958 3.899637
O  1.345476 -1.810276 5.873818
H  0.84032 -1.172648 5.297705
H  0.876746 -1.852241 6.713045
O  4.137598 -2.640041 3.241566
H  4.789995 -3.209337 2.821025
H  3.38486 -3.218597 3.481342
H  1.559867 -3.218354 4.832324
C  1.608591 -3.949112 -0.332253
H  1.825987 -4.332998 0.684453
H  1.033356 -4.746486 -0.837994
C  2.922712 -3.791393 -1.065266
H  2.714334 -3.557756 -2.121944
H  3.492257 -4.725768 -1.051054
O  3.727548 -2.788091 -0.479513
H  3.111005 -2.116205 -0.138367
O  0.294155 -2.174147 2.160632
H  0.69189 -2.870992 2.70701
H  0.47394 -2.445577 1.192949
H  1.596446 -4.687744 4.316622
elementType: Ru P O N C H
totalener: -2241.34824125 hartree
nucrepener: 5744.70578871 hartree
electener: -7986.05402996 hartree
twoeener: 6568.31967744 hartree
cpcmener: -0.03273237 hartree
kineticenergy: 2174.57531472 hartree
exchangeener: -188.054334096758 hartree
correlationener: -10.355908761214 hartree
xcener: -197.271134310978 hartree
chargesum: -0.0000000
charge: -0.056894 0.414594 -0.232978 -0.019699 -0.287517 0.120777 -0.171492 0.135824 -0.105869 0.152356 -0.138794 0.134756 0.102935 -0.011513 0.002069 -0.380858 0.131311 0.140638 0.138843 -0.416784 0.135666 0.131299 0.135343 -0.403037 0.129685 0.153611 0.135364 -0.020295 -0.422866 0.132111 0.144231 0.131755 -0.360406 0.129357 0.123227 0.141583 -0.386183 0.134569 0.115349 0.136332 0.263247 -0.156275 0.022634 -0.103552 0.139541 -0.136512 0.146352 0.163239 0.156888 -0.152531 -0.136693 0.170026 -0.615936 0.173970 -0.490941 0.237010 0.226281 -0.438728 -0.489032 0.235764 0.232075 -0.476283 0.217869 0.228578 -0.490193 0.247220 0.234503 -0.470068 0.255559 0.222417 -0.445036 0.221579 0.245953 0.244613 -0.037939 0.061435 0.064340 0.006278 0.059890 0.101614 -0.413236 0.216773 -0.540472 0.208842 0.296100 0.224439
charge: -0.308860 0.919504 0.163135 0.272951 -0.117192 -0.146856 0.012514 0.035452 0.028448 0.038129 0.020010 0.032523 -0.121307 -0.318320 -0.278452 0.000301 0.018017 0.014862 0.012614 -0.001366 0.021336 0.010458 0.014087 0.003604 0.016550 0.013660 0.019455 -0.283431 0.000816 0.010309 0.019065 0.021660 0.004745 0.021064 0.015326 0.010907 0.000490 0.018643 0.014152 0.016516 -0.117090 0.025275 -0.050412 0.030077 0.034133 0.002146 0.032055 0.036877 0.033735 0.266030 -0.097192 0.024130 -0.009398 0.026840 0.265653 -0.177560 -0.174298 0.354477 0.281281 -0.168829 -0.172560 0.322548 -0.159277 -0.176371 0.314289 -0.174043 -0.170591 0.345988 -0.179839 -0.124554 0.345715 -0.119819 -0.171337 -0.174176 -0.251072 -0.003641 0.000111 -0.147069 -0.000303 0.005211 0.233129 -0.152602 0.276379 -0.188414 -0.221747 -0.119405
qa: -0.0569 0.4146 -0.2330 -0.0197 -0.2875 0.1208 -0.1715 0.1358 -0.1059 0.1524 -0.1388 0.1348 0.1029 -0.0115 0.0021 -0.3809 0.1313 0.1406 0.1388 -0.4168 0.1357 0.1313 0.1353 -0.4030 0.1297 0.1536 0.1354 -0.0203 -0.4229 0.1321 0.1442 0.1318 -0.3604 0.1294 0.1232 0.1416 -0.3862 0.1346 0.1153 0.1363 0.2632 -0.1563 0.0226 -0.1036 0.1395 -0.1365 0.1464 0.1632 0.1569 -0.1525 -0.1367 0.1700 -0.6159 0.1740 -0.4909 0.2370 0.2263 -0.4387 -0.4890 0.2358 0.2321 -0.4763 0.2179 0.2286 -0.4902 0.2472 0.2345 -0.4701 0.2556 0.2224 -0.4450 0.2216 0.2460 0.2446 -0.0379 0.0614 0.0643 0.0063 0.0599 0.1016 -0.4132 0.2168 -0.5405 0.2088 0.2961 0.2244
va: 5.1987 3.8860 2.2713 3.0915 3.7589 3.6946 3.8971 1.0064 3.9135 0.9953 3.8317 1.0136 3.8718 3.5460 3.9269 3.7798 0.9902 0.9976 0.9791 3.8010 0.9974 0.9836 0.9811 3.7580 0.9804 0.9979 0.9947 3.9027 3.8080 0.9831 0.9855 0.9975 3.7867 0.9919 0.9905 0.9819 3.7749 0.9843 1.0233 0.9980 3.5867 3.9843 3.9186 3.9375 1.0093 3.9321 0.9910 0.9846 0.9892 3.2196 1.0085 0.9841 1.6580 1.0074 2.0163 1.0626 1.0789 2.0345 2.0150 1.0570 1.0637 2.0003 1.0773 1.0706 2.0408 1.0607 1.0889 2.0155 1.0620 1.0194 2.0413 1.0230 1.0506 1.0540 3.9245 0.9904 0.9847 3.8213 0.9751 0.9979 1.9796 1.0907 1.9244 1.0783 1.0021 1.0179
energy: -2241.348241246792
dipole: 4.06174 -5.61981 -1.55807 5.30878 -5.55216 -0.24338 142.90942 -142.27073 0.63869
magnitude: 1.70140 au
magnitude: 4.32461 debye
