program: Gaussian 09
title: 000032528
version: EM64L-G09RevD.01
frameworkgroup: C1[X(C12H20N2)]
method: RPBEPBE
basis: SDD
operation: Freq
keyword: #pfreq=noraman
keyword: PBEPBE/SDD
title: #p freq=noraman PBEPBE/SDD
converged: YES YES NO NO
title: Mulliken charges:
elementType: N N C C C C C C C C C C C C H H H H H H H H H H H H H H H H H H H H
charge: -0.368688 -0.015060 0.279213 0.355961 -0.206266 -0.115735 -0.538715 -0.523485 -0.480052 -0.824310 -0.794641 -0.792241 -0.375291 -0.145900 0.241274 0.231703 0.241537 0.223384 0.231882 0.210714 0.231247 0.208038 0.205702 0.231650 0.214653 0.210819 0.239241 0.214979 0.215113 0.233650 0.214366 0.262013 0.259740 0.223501
chargesum: 0.00000
title: Mulliken charges with hydrogens summed into heavy atoms:
elementType: N N C C C C C C C C C C C C
charge: -0.106675 -0.015060 0.279213 0.355961 0.035008 0.115968 -0.073794 -0.080888 -0.040767 -0.172304 -0.129602 -0.129111 0.107951 -0.145900
polarizability: 1.61984574e+02 1.48583012e-01 1.17833237e+02 -6.18644984e+00 -7.04110606e-01 1.19959145e+02
1716.lowfreq: -13.1786 -5.2747 0.0001 0.0005 0.0006 23.7214 36.7181 71.0417 102.5200
frequency: 36.2350 70.9790 102.4733 115.9033 169.7390 187.4810 188.8861 208.3029 226.6885 245.7002 263.9759 280.7353 324.4357 347.6275 363.8749 378.7422 419.4715 443.9325 464.9517 507.5331 559.6817 573.4846 590.2873 638.4249 659.4239 732.5914 777.5190 819.6062 831.5765 882.7833 913.3328 921.1592 931.8534 942.7776 944.6898 962.9796 968.4964 979.4244 992.4262 1031.9114 1042.6236 1073.4202 1084.2347 1103.1759 1129.8434 1146.1239 1154.8700 1169.8308 1199.5103 1204.7075 1212.3474 1222.6624 1235.6887 1250.9135 1267.3264 1278.0537 1294.6248 1304.3755 1315.6000 1335.3492 1367.5235 1382.1343 1388.0003 1399.9682 1449.5080 1458.2144 1459.5692 1467.2353 1470.7123 1474.8788 1476.9428 1481.3835 1486.2105 1493.1602 1499.0244 2204.9601 2850.4692 2860.9586 2963.1583 2975.1966 2979.4735 3000.5132 3002.1165 3013.8074 3017.0999 3043.7002 3046.0039 3053.2337 3056.1544 3059.9594 3063.1106 3064.2405 3081.9616 3088.5042 3094.1685 3433.7064
redmass: 4.9238 4.5587 2.6728 1.7914 1.5659 2.4125 1.0743 1.3055 2.2027 2.4701 3.3763 2.9356 2.0980 2.3025 3.6951 2.7705 2.1577 2.8158 2.6612 2.8024 4.3499 3.5440 3.7457 3.4428 1.4417 2.4610 2.2915 1.7422 2.1149 2.3095 2.3861 3.0375 1.6933 1.8794 1.3942 1.8592 1.9045 2.3402 1.4266 1.7827 2.1707 1.6147 1.5031 1.6605 2.5395 2.4441 1.8939 2.1637 1.9743 1.2411 1.7379 1.8369 1.7531 1.6706 1.8646 1.4274 1.4968 1.6105 1.7796 1.3457 1.3490 1.2099 1.2336 1.1952 1.1799 1.0733 1.0699 1.0774 1.0607 1.0611 1.0563 1.0674 1.0689 1.0678 1.0605 12.4803 1.0712 1.0823 1.0368 1.0376 1.0378 1.0609 1.0603 1.0642 1.0839 1.0970 1.0891 1.0991 1.1032 1.0980 1.1017 1.0994 1.1019 1.0966 1.0963 1.0742
irintensity: 3.3013 3.4735 3.5621 2.5049 0.9506 0.2815 0.0142 0.1082 0.5247 0.2452 0.0557 0.2702 0.8485 0.3392 0.4955 1.1447 0.2942 9.5095 1.4923 1.8974 1.2845 1.2816 3.0071 1.6602 78.4373 1.9395 4.6612 1.5176 0.7565 0.7376 1.2151 1.3380 2.6199 3.0929 2.8035 2.1837 5.5451 3.6106 0.9961 1.6650 6.8040 9.3200 5.7396 6.7334 21.1184 31.8924 4.1981 4.7987 3.7584 21.6759 9.5110 0.1763 1.4312 1.9574 0.2243 2.1759 0.0963 2.7471 2.2097 19.6196 10.6100 9.3936 14.0938 31.1194 13.0851 2.7432 1.5406 5.0309 18.9049 19.3045 2.4539 5.0611 9.2693 12.6827 7.0803 5.3946 84.0131 79.1679 34.5826 23.7736 54.2778 41.3182 22.4718 58.8333 10.1904 30.5663 49.5877 1.1163 16.7860 61.6005 31.3182 29.2760 44.9626 55.3910 24.4404 0.6473
temp: 298.150 k
press: 1.00000 atm
elementType: 7 7 6 6 6 6 6 6 6 6 6 6 6 6 1 1 1 1 1 1 1 1 1 1 1 1 1 1 1 1 1 1 1 1
symmnumber: 1
zpe: 781965.0 jmol-1
zpe.correction: 0.297835 hartree
zpe.thermalcorrener: 0.312519 hartree
zpe.thermalcorrenthalpy: 0.313463 hartree
zpe.thermalcorrgfe: 0.257136 hartree
zpe.sumelectzpe: -577.640095 hartree
zpe.sumelectthermal: -577.625410 hartree
zpe.sumelectthermalent: -577.624466 hartree
zpe.sumelectthermalfe: -577.680794 hartree
dipole: -4.0537 0.6538 2.2023
dipole: 4.6594
quadrupole: -113.0836 -84.6884 -86.0459
quadrupole: 0.7290 8.4536 -1.3424
quadrupole: -18.4776 9.9176 8.5601 0.7290 8.4536 -1.3424
hfenergy: -577.9379294 hartree
pointgroup: C01 [X(C12H20N2)]
dipole: -1.5925418 -0.2181078 -0.8812831 debye
polarizability: 161.8634481|-1.0413677|117.8717005|6.4917186|-0.8507566|120.0418071 unknown
InChI: InChI=1S/C12H20N2/c1-11(2)9-4-5-12(11,3)10(8-9)14-7-6-13/h9-10,14H,4-5,7-8H2,1-3H3
charge 0 multiplicity 1
34 atoms
N  1.592281 -0.295889 0.129402
N  5.06774 -0.194226 0.521168
C  -0.911857 -0.690304 0.351263
C  -2.144998 -0.013194 -0.390186
C  -1.535101 1.430378 -0.266039
C  0.276499 -0.2053 -0.552961
C  -0.839881 0.132858 1.682662
C  -0.128674 1.269273 -0.921916
C  -1.310484 1.572169 1.267317
C  -0.968548 -2.209436 0.551418
C  -3.491947 -0.196493 0.352096
C  -2.373757 -0.475291 -1.852098
C  2.736038 -0.02491 -0.767653
C  4.024772 -0.109823 -0.050961
H  -2.143518 2.23729 -0.710275
H  0.28618 -0.835001 -1.476999
H  0.188433 0.139715 2.080083
H  -1.497188 -0.311681 2.451943
H  -0.162398 1.425355 -2.015092
H  0.589806 1.99194 -0.494405
H  -2.241532 1.862894 1.786073
H  -0.551294 2.340538 1.496663
H  -0.100715 -2.580256 1.131796
H  -1.874366 -2.501459 1.114032
H  -0.978434 -2.74943 -0.414707
H  -3.866663 -1.22993 0.225675
H  -3.429703 0.004897 1.433757
H  -4.254556 0.483846 -0.072378
H  -3.241674 0.059646 -2.28218
H  -1.514052 -0.291325 -2.516908
H  -2.604851 -1.556997 -1.890679
H  1.708681 -1.197376 0.613784
H  2.635529 1.00027 -1.172604
H  2.792135 -0.709449 -1.65289
