program: Gaussian 16
title: P-Arm deprotonated
version: ES64L-G16RevC.01
method: RM06L
basis: def2TZVP/W06
operation: Freq
keyword: #N
keyword: Geom=AllCheck
keyword: Guess=TCheck
keyword: SCRF=Check
keyword: GenChk
keyword: RM06L/def2TZVP/W06
keyword: Freq
keywords: q
keyword: Fre
hfenergy: -1404.6256809 hartree
pointgroup: C01 [X(C20H35N2O1P1Ru1)]
dipole: -0.8209802 1.1812147 -0.6796907 debye
polarizability: 370.2374316|-1.6272894|512.3437701|-51.9759494|10.1591608|497.3203622 unknown
InChI: InChI=1S/C19H34N2P.CO.Ru.H/c1-17(2,3)20-13-15-11-10-12-16(21-15)14-22(18(4,5)6)19(7,8)9;1-2;;/h10-13,20H,14H2,1-9H3;;;/q-1;;+1;
charge 0 multiplicity 1
60 atoms
Ru -0.37728545 -1.17946445 -0.01719119
P  -0.50035237 1.04593263 0.37838585
N  -0.59476846 -3.41215242 0.30298478
O  1.29387431 -0.9334234 -2.49311026
C  -2.30834599 -1.48904301 4.42447006
N  -1.41150794 -1.2642544 1.82133784
C  -1.78204769 1.10628658 1.70834245
H  -1.68063692 1.98265876 2.35077191
C  -1.81566766 -0.16637936 2.49645282
C  -2.26617472 -0.22209711 3.79372547
H  -2.58892198 0.67544826 4.30141677
C  -1.92018288 -2.61060239 3.76321591
H  -1.9504595 -3.58148425 4.24154044
C  -1.44578533 -2.5271876 2.41019719
C  -1.01491693 -3.59570163 1.67643029
H  -1.01315925 -4.59664994 2.08486752
C  1.01109949 1.85411268 1.15685336
C  2.24173474 1.57186359 0.29769605
H  2.42146662 0.5019003 0.198317
H  3.12061205 2.0144292 0.77188871
H  2.16465631 1.9928241 -0.70365088
C  1.20864121 1.19149597 2.52227562
H  0.42116057 1.45573773 3.22837329
H  2.15444339 1.53251888 2.94841542
H  1.25005375 0.10414608 2.45091733
C  0.86203774 3.35608858 1.36964948
H  0.84097099 3.91100977 0.43297407
H  1.71968358 3.72110416 1.93990035
H  -0.03274975 3.60798182 1.94034584
C  -1.24351114 2.12922188 -0.97342851
C  -2.28473863 1.24802745 -1.66874899
H  -1.8215987 0.39006449 -2.15873336
H  -2.80131142 1.83001487 -2.43523645
H  -3.04438721 0.87490108 -0.978522
C  -1.93988275 3.38747084 -0.45992704
H  -2.75311148 3.16298112 0.22960262
H  -2.38084244 3.9165622 -1.3081696
H  -1.26163362 4.0798774 0.03135517
C  -0.17571714 2.51089263 -1.99356343
H  0.54368226 3.22413349 -1.59333405
H  -0.65192266 2.98216513 -2.85637276
H  0.37223671 1.64190488 -2.35854654
H  0.33095837 -3.81490125 0.17763562
C  -1.48132976 -4.07785338 -0.73728546
C  -1.82422165 -5.50446144 -0.32787758
H  -0.92201654 -6.09120781 -0.14640389
H  -2.3837843 -5.99438464 -1.12453364
H  -2.43573272 -5.53251547 0.57247746
C  -0.71797261 -4.10530157 -2.05012769
H  -0.54894887 -3.10340689 -2.43992857
H  -1.27683443 -4.66511934 -2.79956047
H  0.25233216 -4.59203445 -1.93186028
C  -2.74203174 -3.24212148 -0.86367332
H  -3.24546479 -3.14440207 0.09919036
H  -3.44308124 -3.6928706 -1.56611237
H  -2.5030624 -2.23811649 -1.23257715
C  0.61293003 -1.04442464 -1.54895641
H  -2.65874641 -1.56386357 5.44763464
H  0.99010988 -1.17910349 0.73710557
H  -2.74116671 1.21565397 1.19397567
