program: Gaussian 16
title: P-Arm deprotonated
version: ES64L-G16RevB.01
method: RM06L
basis: def2TZVP/W06
operation: Freq
keyword: #N
keyword: Geom=AllCheck
keyword: Guess=TCheck
keyword: SCRF=Check
keyword: GenChk
keyword: RM06L/def2TZVP/W06
keyword: Freq
keywords: q
keyword: Fre
hfenergy: -2017.5520852 hartree
pointgroup: C01 [X(C20H53N2O9P1Ru1)]
dipole: -2.615776 0.6736346 3.5873841 debye
polarizability: 491.3084222|2.163127|551.9354821|-41.1492636|-3.5323882|539.1096763 unknown
InChI: InChI=1S/C19H35N2P.CO.8H2O.Ru.2H/c1-17(2,3)20-13-15-11-10-12-16(21-15)14-22(18(4,5)6)19(7,8)9;1-2;;;;;;;;;;;/h10-12,20H,13-14H2,1-9H3;;8*1H2;;;/q-1;;;;;;;;;;+1;;
charge 0 multiplicity 1
86 atoms
Ru -0.47352844 -1.17138597 0.35414485
P  -0.19099095 1.05280628 0.59524491
N  -1.05459653 -3.32238419 0.90158223
O  0.89004425 -1.41451161 -2.29096176
C  -2.60252722 -0.79702032 4.73027281
N  -1.39806613 -0.96079803 2.27403961
C  -1.50985676 1.41095724 1.85084518
H  -1.32511385 2.32110157 2.4246862
C  -1.76167922 0.24385023 2.74771641
C  -2.36065025 0.35116515 3.99416401
H  -2.64113313 1.32529798 4.37115801
C  -2.23220713 -2.02992628 4.21874835
H  -2.40818859 -2.94410138 4.76983612
C  -1.61350839 -2.07888148 2.98095413
C  -1.05752492 -3.32960574 2.3793653
H  -1.56127746 -4.20457795 2.79500672
H  -0.00906924 -3.39327269 2.69005035
C  1.40449748 1.60337978 1.46436231
C  2.60856243 1.08552175 0.67885868
H  2.51855461 0.02115251 0.46140218
H  3.51642236 1.22810556 1.26945856
H  2.74862754 1.61109077 -0.2638554
C  1.39978251 0.94346008 2.84629186
H  0.64742728 1.37886753 3.50558552
H  2.37173972 1.10253632 3.31798098
H  1.23544232 -0.13232808 2.78919984
C  1.53799246 3.10714884 1.67643363
H  1.66719776 3.65727359 0.74643522
H  2.42408465 3.30027893 2.28650218
H  0.68522494 3.52795947 2.21085116
C  -0.59501762 2.26555064 -0.79988561
C  -1.72048696 1.67106124 -1.64489054
H  -1.42229517 0.74321533 -2.1292225
H  -1.99073448 2.39108332 -2.42102744
H  -2.61569679 1.46237295 -1.05861333
C  -1.07038667 3.62952483 -0.29844453
H  -2.00369503 3.55720793 0.2596568
H  -1.26824745 4.2690851 -1.16186021
H  -0.34465181 4.14598778 0.32244097
C  0.62697779 2.43575981 -1.69957466
H  1.42260353 3.00744837 -1.22552792
H  0.33431393 2.97779763 -2.60156822
H  1.0379634 1.47643725 -2.01625457
H  -0.20882999 -3.81932914 0.61907767
C  -2.20350726 -4.05004485 0.25697013
C  -2.14328058 -5.53515109 0.6084447
H  -1.19187106 -5.97183851 0.30090053
H  -2.93752353 -6.07302564 0.09129891
H  -2.27476822 -5.72091652 1.67404797
C  -2.03483783 -3.89293276 -1.24538009
H  -2.13415909 -2.84979299 -1.54112202
H  -2.78787698 -4.478456 -1.77252682
H  -1.05207215 -4.24522525 -1.5669465
C  -3.51783387 -3.44778299 0.71811731
H  -3.69017867 -3.61310867 1.78293434
H  -4.34653708 -3.9090819 0.18168043
H  -3.54210604 -2.37534197 0.52167578
C  0.33379987 -1.31544615 -1.25981221
H  -3.0799934 -0.73031797 5.69924548
H  0.97851368 -1.64177523 1.15411708
H  -2.41923851 1.59072122 1.26827202
H  -2.0157688 -0.85663761 -0.26866394
O  3.09733456 -2.66707925 -0.76295981
O  2.56170943 -4.47948663 3.1787876
H  2.86569978 -3.55368565 2.9885536
H  2.12822125 -4.45945323 4.03730805
O  5.1629071 -4.34380455 -1.51562961
H  3.80460945 -3.1755261 -1.21269656
H  4.69995641 -5.16186762 -1.26666884
O  4.80648502 -5.82222981 2.14646524
H  4.03288737 -5.51449555 2.65144142
H  4.42538734 -6.21881974 1.34250625
O  1.65162485 -4.64873299 0.49164956
H  2.0867037 -3.84974086 0.10978929
H  1.8347029 -4.60602661 1.44803473
O  3.56692277 -6.40474234 -0.32625341
H  2.76632373 -5.87062541 -0.11011175
H  3.24716643 -7.23290417 -0.69744727
O  5.68312459 -3.46973816 1.11279993
H  6.52784408 -3.18450585 1.47569776
H  5.47250994 -4.32435067 1.56256752
H  5.56017635 -4.04716283 -0.67683936
H  2.5710773 -2.24836611 -1.45558781
O  3.39517151 -2.1290093 2.22796409
H  4.12519354 -2.41144472 1.64749779
H  2.66341203 -1.89393241 1.62505855
