program: Gaussian 16
title: P-Arm deprotonated
version: ES64L-G16RevB.01
method: RM06L
basis: def2TZVP/W06
operation: Freq
keyword: #N
keyword: Geom=AllCheck
keyword: Guess=TCheck
keyword: SCRF=Check
keyword: GenChk
keyword: RM06L/def2TZVP/W06
keyword: Freq
keywords: q
keyword: Fre
hfenergy: -2246.7059593 hartree
pointgroup: C01 [X(C22H57N2O11P1Ru1)]
dipole: -3.7810539 -3.6733267 -0.1768561 debye
polarizability: 532.4888991|-4.9314547|580.0773999|-46.0157358|-16.3804811|564.1231932 unknown
InChI: InChI=1S/C19H35N2P.C2H5O2.CO.8H2O.Ru.H/c1-17(2,3)20-13-15-11-10-12-16(21-15)14-22(18(4,5)6)19(7,8)9;3-1-2-4;1-2;;;;;;;;;;/h10-12,20H,13-14H2,1-9H3;3H,1-2H2;;8*1H2;;/q2*-1;;;;;;;;;;+2;
charge 0 multiplicity 1
94 atoms
Ru 0.26445271 -1.14666485 0.12365978
P  -0.15712536 1.05272975 0.35592653
N  0.08575927 -3.41757995 0.44309063
O  2.22762665 -0.83023111 -2.10750887
C  -2.99452911 -1.58453961 3.7198433
N  -1.21422111 -1.32229256 1.65458891
C  -1.81336487 0.97219968 1.18746305
H  -2.04604356 1.86584223 1.76865095
C  -1.97435843 -0.26710119 2.00676947
C  -2.87072795 -0.37406778 3.05730479
H  -3.46046812 0.48430774 3.34831862
C  -2.23277619 -2.66732059 3.31824174
H  -2.31838319 -3.62835806 3.80886428
C  -1.33618127 -2.50282001 2.27432682
C  -0.41287947 -3.59335724 1.82640237
H  -0.89898064 -4.56052492 1.96635282
H  0.45746156 -3.58691987 2.4846366
C  0.93095502 1.97892789 1.59616296
C  2.38990139 1.69963211 1.23715006
H  2.58622763 0.62766655 1.25553995
H  3.04101407 2.17604085 1.97429242
H  2.66744468 2.0869013 0.25717265
C  0.63734495 1.33973557 2.95415971
H  -0.32896346 1.6497332 3.35372723
H  1.39908963 1.64600792 3.67656748
H  0.66429512 0.25567194 2.89442264
C  0.69189451 3.47773999 1.7224123
H  0.97188303 4.03703708 0.83154176
H  1.30464531 3.85817647 2.54383081
H  -0.34512366 3.71158501 1.9657696
C  -0.48243399 2.14345569 -1.15037219
C  -1.17426381 1.30778913 -2.22659051
H  -0.54030572 0.5036152 -2.59404934
H  -1.41853032 1.95935486 -3.06888964
H  -2.10568372 0.86178277 -1.87570612
C  -1.39168971 3.3328476 -0.83820018
H  -2.37986012 3.01619398 -0.50445482
H  -1.53696015 3.91077416 -1.75375685
H  -0.98400069 4.00968432 -0.09372045
C  0.84772912 2.63497855 -1.71738909
H  1.3491291 3.34483077 -1.06246984
H  0.66617604 3.14398082 -2.66664025
H  1.53468152 1.81233798 -1.91670101
H  1.07166127 -3.66401431 0.45802709
C  -0.5554185 -4.31401811 -0.58180765
C  -0.26305108 -5.77698508 -0.25906652
H  0.81195754 -5.95999054 -0.21590894
H  -0.67680004 -6.42058484 -1.0347906
H  -0.70058951 -6.09582923 0.6862761
C  0.06807974 -3.97271609 -1.9251027
H  -0.19741848 -2.96414518 -2.23677098
H  -0.27604172 -4.67214346 -2.68659961
H  1.1573548 -4.03865476 -1.88000728
C  -2.05144733 -4.05956513 -0.60609351
H  -2.53148548 -4.34728151 0.33053439
H  -2.51398973 -4.6455164 -1.39957126
H  -2.26244782 -3.00651471 -0.79404207
C  1.47042343 -0.95182967 -1.22680283
H  -3.68678217 -1.68188993 4.54648639
H  -0.93836615 -1.10797507 -0.94640246
H  -2.54535601 0.93358946 0.37416304
O  1.7256686 -1.54634235 1.76863002
C  2.95726591 -2.04223625 1.4021484
H  3.51433809 -1.34800132 0.74304538
H  2.89602764 -2.98702057 0.81499701
C  3.82111648 -2.31710116 2.61614103
H  3.3033491 -3.01856951 3.29009516
H  3.96167524 -1.38383089 3.17681182
O  5.06135208 -2.85247773 2.17936419
H  5.64624821 -2.8951325 2.94162778
O  -1.08751195 -2.80568277 7.09518633
O  1.37783948 0.63754687 7.51771786
H  0.59074711 0.49722039 6.95352909
H  2.11008152 0.33115898 6.9455241
O  0.86663138 -4.12435552 5.62080764
H  -0.54179306 -3.40457013 6.54762423
H  1.67835263 -3.96684451 6.15613532
O  3.21819947 -0.64378661 5.81580615
H  2.52035209 -0.92700069 5.18857901
H  3.40525414 -1.46938062 6.28913208
O  1.11926281 -1.87363149 8.65472495
H  0.27111645 -2.16819009 8.28207059
H  1.2009169 -0.93579805 8.36534994
O  2.90287143 -3.19043469 7.16298387
H  2.30311536 -2.73039001 7.81082852
H  3.5127225 -3.71690538 7.68950242
O  1.08582856 -1.6149854 4.29165224
H  1.33495035 -1.61857331 3.3124518
H  0.9943504 -2.54372538 4.55763719
H  0.91670374 -5.03515201 5.31431148
H  -1.83161342 -3.33179011 7.4043602
O  -0.74340743 -0.20326532 5.87762246
H  -0.18633615 -0.58701535 5.17185474
H  -1.07946912 -0.99674229 6.32288535
