program: Gaussian 09
title: 000032548
version: EM64L-G09RevD.01
frameworkgroup: C1[X(C15H23NO)]
method: RPBEPBE
basis: SDD
operation: Freq
keyword: #p
keyword: freq=noraman
keyword: PBEPBE/SDD
title: #p freq=noraman PBEPBE/SDD
converged: YES YES NO NO
title: Mulliken charges:
elementType: O N C C C C C C C C C C C C C C C H H H H H H H H H H H H H H H H H H H H H H H
charge: -0.240417 -0.375948 0.278984 0.358728 -0.205995 -0.101666 -0.537514 -0.526368 -0.480263 -0.825971 -0.796914 -0.792367 -0.444664 0.301851 -0.413662 -0.265274 -0.183645 0.238185 0.228641 0.221296 0.234044 0.211696 0.231707 0.205162 0.228495 0.215465 0.227526 0.205012 0.209516 0.213113 0.238257 0.236944 0.211980 0.212478 0.250172 0.210213 0.240741 0.274731 0.249846 0.255884
chargesum: 0.00000
title: Mulliken charges with hydrogens summed into heavy atoms:
elementType: O N C C C C C C C C C C C C C C C
charge: -0.240417 -0.125776 0.278984 0.358728 0.032190 0.126975 -0.082174 -0.082965 -0.046606 -0.177967 -0.136027 -0.130965 0.006289 0.301851 -0.138931 -0.015428 0.072239
polarizability: 2.05067135e+02 -3.34232434e+00 1.51483589e+02 -3.57760861e+00 2.05847876e+00 1.29631405e+02
1716.lowfreq: -21.0233 -0.0005 0.0007 0.0008 6.0955 8.1419 27.7475 32.7715 54.6622
frequency: 26.8558 32.4981 54.5543 94.1912 116.2499 151.0394 179.0541 200.4155 205.2266 215.2194 226.3387 249.0512 254.0922 275.8084 315.4332 338.8864 372.0417 397.7818 419.2459 464.3927 502.2437 523.3343 566.5060 579.7497 592.9353 614.1017 637.4995 688.8749 709.8105 718.6288 733.7694 786.7835 816.9353 821.6604 830.5222 869.1915 876.7378 881.5557 902.4538 911.1754 929.9170 936.8384 942.5021 956.7945 970.3095 974.6683 990.5428 1001.6612 1032.2583 1039.6222 1043.6906 1074.4870 1085.0948 1103.0995 1127.3574 1133.8846 1145.9467 1152.9592 1157.7858 1172.2977 1198.6023 1207.6167 1212.5002 1217.6867 1226.2844 1236.4433 1249.6852 1265.7437 1276.9243 1295.8079 1302.4135 1314.9806 1336.2896 1357.3338 1376.6957 1381.9300 1384.8645 1396.8827 1447.0364 1453.8251 1458.7350 1471.1691 1471.5492 1475.6320 1480.6352 1482.0747 1484.7827 1490.5884 1492.2391 1497.0350 1593.0150 2859.1604 2865.5685 2962.0090 2972.9586 2977.3279 2985.9163 2997.2461 3003.3495 3009.0648 3042.6083 3044.3045 3050.9038 3052.7793 3057.9017 3060.3408 3064.0969 3077.6996 3086.8707 3090.9088 3219.1475 3241.8481 3267.5797 3417.3342
redmass: 4.1042 4.0414 3.9040 2.6889 1.9357 2.2401 1.7085 1.3303 1.1999 2.4407 2.0566 2.6793 2.5345 2.7863 2.1611 2.2004 2.8887 2.7368 2.1150 2.4368 2.9641 3.5860 3.9043 3.2154 3.4128 3.5412 3.5131 1.7416 2.5450 1.2859 2.3218 2.1646 1.6567 1.3454 2.0376 6.2266 1.3537 2.3419 3.3993 2.2356 1.7049 1.6109 1.5000 2.0530 1.8282 2.3237 1.4115 1.6917 1.7282 2.7632 2.1697 1.4618 1.5322 1.6426 1.6833 2.0780 2.2908 2.1226 2.0711 2.2128 1.9972 1.7189 1.7878 1.6871 1.6652 1.7228 1.6306 1.8601 1.4363 1.4912 1.6621 1.8922 1.7805 1.5139 1.2556 1.3789 1.4077 1.1970 1.2043 1.0732 1.0769 1.0586 1.0631 1.0626 1.1175 1.1387 1.0697 1.1485 2.9573 1.0608 6.7311 1.0821 1.0713 1.0361 1.0374 1.0376 1.0847 1.0609 1.0608 1.0644 1.0892 1.0967 1.0997 1.1023 1.0976 1.0987 1.1032 1.1017 1.0970 1.0967 1.0914 1.0992 1.1082 1.0736
irintensity: 0.2432 0.3124 0.0527 1.3389 0.6715 0.6730 1.1575 0.7662 0.1993 0.6930 1.7738 1.4445 2.7522 1.5151 1.0682 0.4161 1.1150 0.7519 0.9152 4.5788 1.8773 2.7669 0.4330 2.1080 6.0742 2.9694 2.1201 53.8002 9.0726 82.8384 5.1579 3.8775 5.7199 29.5812 1.2481 3.4882 0.7697 2.4391 14.5186 0.7890 4.6244 2.1647 2.5234 0.6082 18.8327 3.7875 4.4271 13.4905 1.4593 1.1011 4.3281 8.0267 2.4506 5.5855 0.5433 17.0802 28.0696 44.3500 27.8910 4.9832 4.2689 0.7669 10.5721 3.8867 0.6804 2.3259 3.2080 0.3094 3.6810 0.3418 1.9921 1.2623 21.3247 16.9160 11.1783 6.6508 9.6024 33.2687 25.2752 3.3989 1.3160 11.1733 24.6642 3.4949 10.2643 9.1311 10.4726 10.9749 3.6791 7.9148 10.5465 53.0895 103.7476 34.6257 21.1103 61.8376 17.4459 35.1805 32.1513 60.9713 35.4185 55.0110 1.1208 14.1558 68.6291 23.4206 32.2374 62.8801 53.9733 22.6063 5.5979 0.6158 0.7929 0.5130
temp: 298.150 k
press: 1.00000 atm
elementType: 8 7 6 6 6 6 6 6 6 6 6 6 6 6 6 6 6 1 1 1 1 1 1 1 1 1 1 1 1 1 1 1 1 1 1 1 1 1 1 1
symmnumber: 1
zpe: 915552.9 jmol-1
zpe.correction: 0.348716 hartree
zpe.thermalcorrener: 0.365547 hartree
zpe.thermalcorrenthalpy: 0.366491 hartree
zpe.thermalcorrgfe: 0.304096 hartree
zpe.sumelectzpe: -714.008361 hartree
zpe.sumelectthermal: -713.991530 hartree
zpe.sumelectthermalent: -713.990586 hartree
zpe.sumelectthermalfe: -714.052981 hartree
dipole: 0.7872 0.0050 0.5471
dipole: 0.9587
quadrupole: -99.8242 -103.7901 -105.1524
quadrupole: -3.2959 -1.5649 0.8823
quadrupole: 3.0980 -0.8679 -2.2302 -3.2959 -1.5649 0.8823
hfenergy: -714.3570767 hartree
pointgroup: C01 [X(C15H23N1O1)]
dipole: 0.3099053 -0.0839284 0.1979105 debye
polarizability: 205.0275313|-1.8794692|146.6442464|-4.7558345|9.3371661|134.5103512 unknown
InChI: InChI=1S/C15H23NO/c1-14(2)11-6-7-15(14,3)13(9-11)16-10-12-5-4-8-17-12/h4-5,8,11,13,16H,6-7,9-10H2,1-3H3
charge 0 multiplicity 1
40 atoms
O  -4.19692 -0.97506 -0.473311
N  -0.638304 -0.198298 0.150094
C  1.838862 -0.211142 0.737563
C  3.130134 -0.280041 -0.187646
C  2.539402 0.737775 -1.23041
C  0.716217 -0.614003 -0.286415
C  1.699258 1.329276 0.985671
C  1.178151 0.083456 -1.618171
C  2.212274 1.978369 -0.348881
C  1.853092 -1.055756 2.017322
C  4.422807 0.209095 0.510793
C  3.441818 -1.678324 -0.779768
C  -1.73714 -0.724634 -0.688626
C  -3.0550 -0.18053 -0.21682
C  -3.439271 0.976366 0.441574
C  -4.879793 0.918317 0.608251
C  -5.304252 -0.269639 0.041538
H  3.191981 0.956331 -2.093812
H  0.751443 -1.724286 -0.413452
H  2.301842 1.641704 1.858105
H  0.647377 1.59172 1.187034
H  0.444844 0.849134 -1.929386
H  1.28661 -0.640048 -2.445703
H  1.445454 2.616674 -0.822606
H  3.107004 2.604838 -0.182792
H  1.919115 -2.137498 1.792738
H  2.71138 -0.787395 2.661032
H  0.938167 -0.896405 2.621228
H  4.776334 -0.540526 1.24425
H  5.229723 0.344593 -0.234558
H  4.297244 1.164905 1.0448
H  2.621358 -2.098629 -1.384116
H  4.334998 -1.619761 -1.430623
H  3.670756 -2.401794 0.026113
H  -0.801508 -0.431306 1.140921
H  -1.799079 -1.841758 -0.70643
H  -1.546494 -0.411623 -1.734696
H  -2.765762 1.769415 0.757139
H  -5.512257 1.664337 1.085802
H  -6.268664 -0.753748 -0.082446
