program: Gaussian 16
title: compound-R-1-prime
version: ES64L-G16RevA.03
frameworkgroup: C1[X(C25H35NO6)]
method: RwB97XD
basis: 6-31G(d)
operation: Freq
keyword: #P
keyword: Geom=AllCheck
keyword: Guess=TCheck
keyword: SCRF=Check
keyword: GenChk
keyword: RwB97XD/6-31G(d)
keyword: Freq
converged: YES YES YES YES
title: Mulliken charges:
elementType: C C C C C H H H H H H H H C C C H C C H H H C H H H C O C C H C H H H C H H H C H H H C C C N C H H O O C H H C C H H H O H C O O H H
charge: -0.308449 -0.175542 -0.099532 -0.138795 -0.105178 0.170201 0.152192 0.159309 0.144568 0.177404 0.185645 0.156446 0.162114 -0.357010 -0.201990 -0.130294 0.154147 -0.206748 -0.157158 0.154170 0.153322 0.227131 -0.502271 0.159896 0.169734 0.155393 0.356395 -0.635870 0.166919 -0.212733 0.165346 -0.577756 0.165898 0.177651 0.194934 -0.590557 0.177097 0.207492 0.164724 -0.506837 0.162275 0.175638 0.169690 -0.146011 0.411869 0.644291 -0.682460 -0.047002 0.204820 0.369894 -0.551914 -0.584164 -0.321064 0.205686 0.183844 0.215086 -0.506130 0.192758 0.181575 0.178107 -0.672660 0.432104 0.591780 -0.496473 -0.580417 0.447873 0.469595
chargesum: -0.00000
title: Mulliken charges with hydrogens summed into heavy atoms:
elementType: C C C C C C C C C C C C O C C C C C C C C N C O O C C C O C O O
charge: 0.003053 -0.005341 0.086113 0.005774 0.072226 -0.038450 0.025141 0.023853 -0.053426 -0.002989 -0.017247 0.356395 -0.166275 0.166919 -0.047387 -0.039273 -0.041244 0.000767 -0.146011 0.411869 0.644291 -0.312567 0.157818 -0.551914 -0.584164 0.068466 0.215086 0.046311 -0.240556 0.591780 -0.496473 -0.132544
chargesum: 0.00000
polarizability: 4.66175548e+02 -2.49748721e+01 2.10087285e+02 3.43664644e+00 4.45683548e+00 2.42938992e+02
1716.lowfreq: -2.2424 -0.0009 -0.0005 0.0003 1.4375 5.5831 16.2516 20.9326 32.6580
frequency: 15.9182 20.7351 32.6507 36.0431 46.2258 60.8711 64.4333 66.5383 79.0925 80.6707 87.2166 92.6927 107.6667 112.4202 120.9914 123.9620 150.4990 160.6546 178.6867 188.1890 191.0673 195.2211 197.4851 214.7119 219.5707 234.1791 235.8792 247.7230 250.2634 255.9810 257.3563 270.6091 284.2023 290.2671 306.2654 321.6952 329.4025 342.9266 351.1042 363.2104 370.5853 378.4362 403.8466 409.7358 427.9719 432.9824 446.8236 478.9251 490.5152 499.1563 516.2479 522.0881 533.3971 539.0127 563.3139 587.2249 603.8356 610.3744 616.8102 624.9603 663.0230 686.1671 711.1366 738.5178 761.8033 785.2677 791.4049 811.5199 829.3014 842.7344 856.6679 861.1159 882.2821 900.9141 910.0909 914.4571 918.6551 928.6489 932.6528 964.5014 971.3750 984.7635 988.1991 989.9087 1001.1503 1020.3435 1040.2799 1050.2791 1053.7650 1065.9560 1076.0805 1078.4063 1086.7618 1089.1602 1102.7969 1116.7046 1120.3883 1134.0030 1138.4062 1153.4707 1155.5531 1177.4823 1179.8518 1192.6927 1205.9596 1210.7247 1232.2620 1240.6984 1255.6711 1279.9235 1284.5225 1286.4923 1288.3941 1310.0524 1319.6489 1325.9126 1327.8430 1333.6048 1349.7090 1357.7832 1365.2384 1378.3794 1380.6316 1386.4253 1397.3524 1405.6800 1411.3498 1419.4530 1420.1108 1434.3264 1437.8652 1443.1694 1446.7814 1448.5931 1462.5170 1466.2953 1470.4851 1473.9328 1503.0565 1504.5393 1515.6446 1522.2706 1526.0248 1526.2519 1528.4496 1532.3688 1533.6295 1535.5026 1535.6934 1537.7064 1539.8939 1553.8728 1670.4093 1710.7030 1746.5530 1754.3659 1767.8848 1774.9502 1845.1240 1860.7496 3032.8785 3049.2803 3050.7225 3054.7820 3063.0840 3069.2818 3070.3243 3072.2382 3079.6185 3090.9087 3093.4229 3095.5931 3105.6076 3109.8754 3129.7126 3136.5379 3137.8649 3139.6977 3143.7086 3151.8968 3154.9676 3165.2152 3165.3410 3168.1779 3170.3376 3173.9443 3175.2556 3181.9717 3184.1692 3188.2538 3241.7540 3274.7758 3706.7582 3746.6983 3773.2515
redmass: 4.5465 4.6800 6.1557 5.5004 6.7833 5.6433 4.9135 4.1623 4.3538 7.3309 3.4192 5.0200 5.1953 3.2908 4.5833 3.2548 6.2592 1.5056 2.9022 1.8226 3.8244 2.0254 2.3708 2.8097 1.9296 2.0963 1.7122 1.3831 1.6756 2.7065 1.8474 2.1290 3.6989 2.2605 2.4136 3.2064 2.5336 2.7643 3.4261 2.3043 3.4934 5.2793 2.5438 2.7999 1.7214 3.8563 3.1244 2.7813 2.4419 2.3580 3.3580 3.5297 2.8842 3.4583 1.3967 3.1069 2.3252 2.5724 2.4504 2.9250 3.6200 4.8135 5.4710 5.4402 4.7266 5.7940 5.1365 1.4598 2.8387 4.0121 2.1229 1.4738 1.8954 1.2397 1.6424 2.2468 1.9802 1.8468 1.7760 2.2257 1.7006 1.7594 1.1632 1.7270 1.6586 2.6544 1.1212 1.5689 1.3933 1.5601 1.6462 1.8512 1.9804 1.5184 2.0273 2.3377 3.0741 2.4403 2.8092 2.3998 2.2541 2.0441 2.0276 2.2297 2.1503 2.1547 1.6050 1.2904 1.3450 1.3057 1.9868 2.0646 2.4498 1.6594 1.7699 1.6228 1.2615 1.3065 1.4554 1.5012 1.3359 1.6901 1.2885 1.3988 1.7391 1.4624 1.2723 1.4646 1.4725 1.4307 1.2858 1.2620 1.2518 1.2634 2.3052 1.6089 4.9392 1.7964 1.3044 1.7871 1.0958 1.0513 1.0671 1.0489 1.0672 1.0521 1.0530 1.1613 1.0464 1.0471 1.0689 1.0648 3.2415 5.9925 5.6114 6.1583 5.8234 8.2237 10.8189 10.3952 1.0653 1.0588 1.0370 1.0388 1.0381 1.0833 1.0397 1.0815 1.0349 1.1001 1.0628 1.0942 1.0904 1.0989 1.1008 1.1021 1.1002 1.1014 1.1018 1.1033 1.1032 1.1034 1.0911 1.0878 1.0892 1.0994 1.1041 1.0898 1.0892 1.0885 1.0924 1.0712 1.0779 1.0650 1.0643
irintensity: 0.4180 0.0879 1.6721 0.0966 0.4371 1.4391 0.5405 0.0025 0.1747 0.5510 1.2203 0.0888 0.7510 0.1007 0.1292 0.3405 4.7681 0.8249 0.7199 0.4232 0.4666 0.3665 1.4545 0.0579 1.9844 5.8095 1.2284 0.3959 0.2975 2.3355 1.6919 1.6184 2.1294 1.0669 0.5230 1.7039 1.4062 1.0647 1.3532 60.6861 2.9724 13.6415 0.8366 2.3989 46.8540 6.2889 1.2828 2.8123 11.2498 0.0570 2.0377 21.5377 13.4891 19.2869 50.9423 1.7259 103.6428 1.3186 100.8117 28.2858 11.3858 37.1416 6.1939 1.9420 47.8871 13.8247 65.5037 9.4906 1.8290 13.8380 5.6968 12.7187 1.3271 68.9661 29.7078 42.2979 11.3347 22.8547 9.2337 24.2543 1.2098 8.9979 1.4053 5.2380 1.4436 10.5985 62.3699 36.3573 12.4721 21.6603 4.0265 3.2908 5.5175 0.2176 1.0420 0.2306 43.2735 6.7403 9.2100 17.5882 1.2843 2.9821 2.8157 10.0722 8.8469 242.5826 49.2330 2.7561 1.0665 2.6376 26.0692 33.5015 8.8710 1.1805 48.1137 16.4997 4.2029 7.4073 18.4588 0.9302 0.7624 92.7429 7.1723 2.8486 13.4549 26.9613 27.4372 8.7377 31.7689 24.2794 16.4615 4.7889 5.8812 1.8980 29.6056 5.4519 135.7576 8.2488 78.1896 199.8783 5.4613 7.4900 8.8058 9.0802 9.7924 8.4629 4.2372 9.4002 5.3319 8.1688 6.1261 10.5582 656.1342 0.2553 385.3098 9.6856 12.5891 242.5732 409.0244 205.9351 37.2528 21.7647 48.7519 45.5638 37.1631 12.4861 20.3968 4.7381 14.9490 28.9018 11.8360 22.3008 7.5719 22.4292 35.5837 11.6580 6.0011 33.8884 28.7608 25.9499 3.7123 13.0317 14.1591 2.1478 19.5931 16.6758 11.7042 4.6280 16.4294 20.4966 10.7260 194.3023 114.2472 81.8725 107.1606
temp: 298.150 k
press: 1.00000 atm
elementType: 6 6 6 6 6 1 1 1 1 1 1 1 1 6 6 6 1 6 6 1 1 1 6 1 1 1 6 8 6 6 1 6 1 1 1 6 1 1 1 6 1 1 1 6 6 6 7 6 1 1 8 8 6 1 1 6 6 1 1 1 8 1 6 8 8 1 1
symmnumber: 1
zpe: 1513464.5 jmol-1
zpe.correction: 0.576448 hartree
zpe.thermalcorrener: 0.610794 hartree
zpe.thermalcorrenthalpy: 0.611738 hartree
zpe.thermalcorrgfe: 0.509903 hartree
zpe.sumelectzpe: -1478.818376 hartree
zpe.sumelectthermal: -1478.784031 hartree
zpe.sumelectthermalent: -1478.783087 hartree
zpe.sumelectthermalfe: -1478.884921 hartree
dipole: -1.5084 1.1230 1.6434
dipole: 2.4975
quadrupole: -157.5071 -191.1284 -196.7747
quadrupole: 1.3458 -0.0584 -1.3558
quadrupole: 24.2963 -9.3250 -14.9713 1.3458 -0.0584 -1.3558
hfenergy: -1479.3948246 hartree
pointgroup: C01 [X(C25H35N1O6)]
dipole: -0.593459 0.4416311 0.646705 debye
polarizability: 466.1754638|-24.9762553|210.0847197|3.4297119|4.4470585|242.9416401 unknown
InChI: InChI=1S/C25H35NO6/c1-6-16(2)10-8-7-9-11-17(3)14-18(4)12-13-20(27)21-22(28)19(26-23(21)29)15-25(5,32)24(30)31/h6-10,12-13,17-19,26-27,30,32H,11,14-15H2,1-5H3
charge 0 multiplicity 1
67 atoms
C  5.56547273 0.43102903 -0.09928944
C  5.43072683 -0.96128495 0.56527486
C  4.0923332 -1.00559241 1.23897651
C  2.80623389 1.98701067 -0.46405412
C  4.72743852 0.58456603 -1.38832248
H  5.46255261 -1.72047963 -0.22725622
H  5.29288481 1.19332842 0.64323745
H  6.62473543 0.60700484 -0.32974877
H  3.05389762 1.98860016 0.59864376
H  3.97298916 -0.20932012 -1.42053079
H  4.03385743 -0.5377778 2.22248127
H  4.64717228 2.74299424 -1.25779607
H  3.55330188 2.05123216 -2.45301515
C  3.94724688 1.91275701 -1.43866692
C  2.96570142 -1.44055207 0.66347223
C  1.51903188 2.05249024 -0.82733266
H  1.2731749 2.04360235 -1.89000692
C  -0.86413283 2.3961543 -0.34264227
C  0.39380718 2.19025856 0.08690567
H  0.6163317 2.16122429 1.15318391
H  -1.03522062 2.40857431 -1.41967434
H  2.94755493 -1.86645639 -0.3347401
C  5.61571268 0.42645062 -2.62492517
H  6.18276442 -0.51094693 -2.58216272
H  5.01926875 0.41479663 -3.54328818
H  6.33665394 1.25057967 -2.69779115
C  1.66132626 -1.21961639 1.26058906
O  1.62399016 -0.93623815 2.55164855
C  -2.05078757 2.64339618 0.48413499
C  -3.22005693 2.87535372 -0.14157229
H  -3.21797785 2.85512288 -1.23067894
C  -4.54923834 3.20658387 0.47019014
H  -4.63039752 2.89938717 1.51823411
H  -5.35351851 2.73744079 -0.10952831
H  -4.73968349 4.28731909 0.43824369
C  -1.87749209 2.6407967 1.98059286
H  -1.10662407 3.3620452 2.2760007
H  -1.5598051 1.65291689 2.33238318
H  -2.79524989 2.90758726 2.50797403
C  6.56559458 -1.22335655 1.55799255
H  6.58394756 -0.45381466 2.33942752
H  6.45196988 -2.19682036 2.04589903
H  7.53491522 -1.20724054 1.04911134
C  0.49515377 -1.2394791 0.5281099
C  -0.76527339 -0.9246988 1.11959192
C  0.3058054 -1.44346114 -0.92577757
N  -1.02652024 -1.21469729 -1.1571345
C  -1.82006366 -0.92886855 0.02049255
H  -2.2426886 0.08445487 -0.02681579
H  -1.46956678 -1.45234328 -2.03184268
O  1.13082208 -1.75343624 -1.77194958
O  -0.988831 -0.67893615 2.31290857
C  -2.9323359 -1.94269918 0.29777209
H  -3.25031504 -1.83726156 1.33936465
H  -2.53749871 -2.95580742 0.16172063
C  -4.14555492 -1.76922176 -0.62320579
C  -5.20784246 -2.84157041 -0.34424001
H  -4.7746374 -3.82459482 -0.54757455
H  -5.54698892 -2.8074136 0.69506538
H  -6.0689957 -2.70305091 -1.00532079
O  -3.71691717 -1.84620389 -1.96828812
H  -4.20846191 -1.16026386 -2.44894536
C  -4.78330484 -0.39261233 -0.42831117
O  -5.06911002 0.33168941 -1.35732397
O  -5.02744944 -0.09232946 0.84733038
H  -5.41239186 0.79924406 0.86782878
H  0.67277979 -0.77597499 2.79568961
