program: Gaussian 09
title: 000032538
version: EM64L-G09RevD.01
frameworkgroup: C1[X(C17H23ClFN)]
method: RPBEPBE
basis: SDD
operation: Freq
keyword: #p
keyword: freq=noraman
keyword: PBEPBE/SDD
title: #p freq=noraman PBEPBE/SDD
converged: NO YES NO NO
title: Mulliken charges:
elementType: Cl F N C C C C C C C C C C C C C C C C C H H H H H H H H H H H H H H H H H H H H H H H
charge: -0.020211 -0.183357 -0.389618 0.276227 0.358287 -0.206804 -0.103354 -0.536712 -0.527672 -0.478181 -0.824014 -0.793975 -0.791431 -0.498076 0.466442 -0.358891 -0.420675 -0.294272 -0.336249 0.396767 0.239858 0.224916 0.228139 0.225201 0.233393 0.209063 0.230180 0.205542 0.204114 0.228585 0.215626 0.209405 0.238784 0.213472 0.213300 0.235646 0.212938 0.249136 0.240056 0.204382 0.302989 0.243089 0.257952
chargesum: 0.00000
title: Mulliken charges with hydrogens summed into heavy atoms:
elementType: Cl F N C C C C C C C C C C C C C C C C C
charge: -0.020211 -0.183357 -0.140482 0.276227 0.358287 0.033053 0.121562 -0.083372 -0.085216 -0.042459 -0.175689 -0.132313 -0.129547 -0.053637 0.466442 -0.055902 -0.177586 -0.294272 -0.078297 0.396767
polarizability: 2.43424265e+02 4.16787642e+00 1.99663985e+02 3.91525775e+00 3.42837721e-01 1.36985381e+02
1716.lowfreq: -14.1009 -3.6822 0.0016 0.0021 0.0022 7.1741 17.8808 25.7602 37.8963
frequency: 16.4104 25.4127 37.7820 81.5843 106.9945 119.9513 148.4249 168.5368 181.1884 192.1908 194.8946 205.8793 218.9570 232.0453 250.6364 263.0888 310.5120 326.1622 343.6503 356.3006 378.4518 405.9796 426.2784 443.2493 453.6589 476.5508 480.0614 510.3483 541.2244 564.4223 574.9886 590.8034 637.1925 667.9224 691.8094 708.4722 735.8211 742.8949 783.3698 813.8796 820.9910 831.4361 876.3558 885.4475 905.3183 911.1158 930.4791 940.7801 941.7178 948.4472 956.0228 976.1446 978.9638 992.9141 1028.9713 1031.5033 1044.4630 1075.4477 1084.1781 1101.7833 1123.4954 1134.6730 1146.8476 1154.4161 1171.1683 1179.3897 1199.2188 1205.8962 1211.9213 1225.0818 1228.9960 1235.2168 1246.9169 1248.4960 1265.8728 1273.8976 1297.1291 1303.1129 1314.1564 1328.8813 1357.2940 1379.3017 1385.1207 1385.9949 1397.2727 1397.9772 1448.4744 1455.3889 1460.3162 1470.2130 1471.5839 1473.4182 1476.5285 1482.9382 1483.4776 1486.0422 1490.3674 1499.1548 1586.5876 1607.4836 2858.3593 2863.4297 2961.4971 2974.1508 2978.1527 2989.0949 2999.4266 3001.6990 3011.7594 3043.0890 3044.8274 3052.0157 3053.9520 3059.1014 3061.0137 3062.7846 3078.5358 3084.4218 3092.9573 3137.0812 3167.2213 3174.0924 3416.1787
redmass: 5.0770 5.0068 5.0207 2.7225 3.4851 1.9278 3.8255 2.0413 2.7574 3.7252 1.1531 1.2205 4.1188 2.8868 2.3486 3.3490 2.5705 3.6134 2.3670 4.2228 2.9082 3.2828 2.2946 3.2821 2.8900 3.8204 5.2363 2.9226 3.8430 4.0312 3.7105 3.6342 3.4505 5.0731 1.9119 2.5836 2.5491 3.5698 2.3761 1.4151 1.7519 2.1044 3.3068 2.5116 1.4652 2.1749 1.5951 1.5430 1.6299 1.3529 2.0083 2.3568 1.8788 1.4801 2.6608 1.8788 2.2166 1.4869 1.5528 1.6231 1.6300 2.0841 2.2766 1.9046 2.0792 1.6249 1.8646 1.4226 1.6017 1.9228 4.7461 1.6848 1.4230 1.6712 1.7928 1.5191 1.4932 1.6233 1.9100 1.6731 1.6377 1.2562 3.4090 1.3921 2.1213 1.2392 1.2075 1.0761 1.0684 1.0748 1.0549 1.4527 1.0896 1.0745 1.6911 1.0737 1.0631 1.0636 7.9882 7.1921 1.0763 1.0782 1.0365 1.0374 1.0376 1.0843 1.0609 1.0606 1.0644 1.0972 1.0895 1.0997 1.1021 1.0978 1.0988 1.1025 1.1019 1.0974 1.0964 1.0898 1.0918 1.0956 1.0738
irintensity: 0.0516 0.0938 0.4104 0.2179 0.8308 0.2547 0.3072 1.3552 0.2268 0.6070 0.0667 0.0165 0.2099 0.3877 0.0909 0.2591 0.7331 1.7356 0.2868 0.7065 1.0580 3.5553 1.8214 7.0482 1.8688 3.7946 2.2263 3.9584 11.1919 2.1254 1.8204 5.6963 2.4689 42.6472 15.9516 20.8345 14.2498 10.2870 15.4168 45.8925 4.6999 0.4004 15.1275 4.0818 13.1145 0.8343 2.8187 3.1737 4.1970 2.3955 1.1806 3.9600 11.1041 1.6660 23.3304 8.5606 6.8297 6.8020 6.2529 7.3570 31.8955 3.9502 29.3960 4.4700 4.8229 3.3645 3.4472 14.4458 22.0228 1.3440 88.0603 1.2094 1.2229 1.8483 0.3127 1.8454 0.6701 1.2279 0.8832 32.9260 21.7214 13.1141 5.5221 10.8473 13.0808 30.1453 20.8590 2.6101 1.5365 12.1073 7.4333 86.5917 31.8727 6.3538 56.3540 6.8883 11.3556 6.2950 11.3631 1.5115 32.4015 137.3305 34.6487 21.1103 62.8709 11.2686 42.6202 26.1244 54.8945 30.6774 55.0044 2.9764 13.7552 63.0044 23.0648 39.3732 63.6405 56.6710 26.1087 8.8966 3.8437 5.1534 0.9610
temp: 298.150 k
press: 1.00000 atm
elementType: 17 9 7 6 6 6 6 6 6 6 6 6 6 6 6 6 6 6 6 6 1 1 1 1 1 1 1 1 1 1 1 1 1 1 1 1 1 1 1 1 1 1 1
symmnumber: 1
zpe: 948190.2 jmol-1
zpe.correction: 0.361147 hartree
zpe.thermalcorrener: 0.380908 hartree
zpe.thermalcorrenthalpy: 0.381852 hartree
zpe.thermalcorrgfe: 0.312117 hartree
zpe.sumelectzpe: -1274.723610 hartree
zpe.sumelectthermal: -1274.703849 hartree
zpe.sumelectthermalent: -1274.702904 hartree
zpe.sumelectthermalfe: -1274.772639 hartree
dipole: -3.6945 -3.0036 0.1995
dipole: 4.7656
quadrupole: -143.2150 -122.8164 -127.6549
quadrupole: -9.6657 -0.5024 -0.0012
quadrupole: -11.9862 8.4123 3.5739 -9.6657 -0.5024 -0.0012
hfenergy: -1275.0847562 hartree
pointgroup: C01 [X(C17H23Cl1F1N1)]
dipole: 1.3787286 -1.1044163 0.6282543 debye
polarizability: 242.537313|-2.6071612|182.0556547|8.738184|-28.6579624|155.4806633 unknown
InChI: InChI=1S/C17H23ClFN/c1-16(2)12-6-7-17(16,3)15(9-12)20-10-11-4-5-14(19)13(18)8-11/h4-5,8,12,15,20H,6-7,9-10H2,1-3H3
charge 0 multiplicity 1
43 atoms
Cl -4.038483 2.251105 -1.588132
F  -6.078384 0.239118 -0.591732
N  0.30525 -0.588311 -0.025369
C  2.748559 -0.355442 -0.710199
C  4.035254 0.025747 0.14298
C  3.277019 1.151026 0.937259
C  1.713468 -0.672953 0.432115
C  2.34624 1.028741 -1.320541
C  2.062009 0.385715 1.542293
C  2.722055 2.06047 -0.199035
C  2.906283 -1.479283 -1.741391
C  5.219685 0.545368 -0.708169
C  4.59098 -1.111539 1.036767
C  -0.695156 -1.044853 0.960299
C  -2.121055 -0.723496 0.522984
C  -2.382627 0.441701 -0.240954
C  -3.201512 -1.560533 0.897033
C  -3.700389 0.762209 -0.61104
C  -4.526792 -1.238593 0.531667
C  -4.763231 -0.076414 -0.221425
H  3.885484 1.686821 1.686576
H  1.929034 -1.700973 0.814111
H  1.268675 1.052729 -1.553048
H  2.897754 1.217335 -2.259679
H  2.315127 -0.095119 2.503938
H  1.209722 1.067398 1.716084
H  3.479838 2.785476 -0.546077
H  1.845832 2.639039 0.143524
H  1.976164 -1.635218 -2.322774
H  3.701613 -1.239471 -2.471195
H  3.163219 -2.442085 -1.25989
H  5.692921 -0.285406 -1.265622
H  4.930099 1.316315 -1.440464
H  5.995198 0.983092 -0.05103
H  5.44746 -0.739328 1.630506
H  3.852719 -1.522051 1.745019
H  4.962201 -1.948952 0.415556
H  0.174421 -1.06696 -0.928887
H  -0.48172 -0.519277 1.912815
H  -0.624572 -2.137084 1.192458
H  -1.542271 1.075589 -0.538239
H  -3.011206 -2.469974 1.478068
H  -5.373685 -1.872176 0.811042
