program: Gaussian 09
title: Rh stay or go A TSS opt
version: EM64L-G09RevB.01
method: UB3LYP
basis: GenECP
operation: Freq
keyword: #N
keyword: Geom=AllCheck
keyword: Guess=TCheck
keyword: SCRF=Check
keyword: GenChk
keyword: UB3LYP/GenECP
keyword: Freq
multiplicity: 1
elementType: C Rh Rh O O O O O O O O C C C C C C C C H H H H H H H H H H H H C H H C H C H H C C C C H C H C H H H Se C O O C H H H H
title: Mulliken atomic charges:
charge: -0.381281 0.413606 0.535906 -0.485564 -0.495142 -0.494296 -0.496079 -0.501660 -0.498713 -0.499652 -0.499706 0.672867 0.677400 0.673503 0.673670 -0.536528 -0.537741 -0.538410 -0.533389 0.199987 0.183290 0.181694 0.190868 0.180412 0.186144 0.186464 0.184596 0.183640 0.184000 0.186855 0.180270 -0.379173 0.158462 0.174892 -0.041413 0.128866 -0.344245 0.170106 0.156347 0.046983 -0.146838 -0.158957 -0.125383 0.152658 -0.121896 0.155266 -0.129650 0.139527 0.138991 0.137369 0.274327 0.652931 -0.459431 -0.479815 -0.209362 0.152529 0.177704 0.162783 0.239407
chargesum: 0.00000
title: Mulliken charges with hydrogens summed into heavy atoms:
elementType: C Rh Rh O O O O O O O O C C C C C C C C C C C C C C C C C Se C O O C
charge: -0.141874 0.413606 0.535906 -0.485564 -0.495142 -0.494296 -0.496079 -0.501660 -0.498713 -0.499652 -0.499706 0.672867 0.677400 0.673503 0.673670 0.028443 0.019682 0.016290 0.017736 -0.045819 0.087453 -0.017791 0.046983 0.005820 -0.003690 0.014145 0.017095 0.007720 0.274327 0.652931 -0.459431 -0.479815 0.283654
charge: 0.000000 0.000000 0.000000 0.000000 0.000000 0.000000 0.000000 0.000000 0.000000 0.000000 0.000000 0.000000 0.000000 0.000000 0.000000 0.000000 0.000000 0.000000 0.000000 0.000000 0.000000 0.000000 0.000000 0.000000 0.000000 0.000000 0.000000 0.000000 0.000000 0.000000 0.000000 0.000000 0.000000 0.000000 0.000000 0.000000 0.000000 0.000000 0.000000 0.000000 0.000000 0.000000 0.000000 0.000000 0.000000 0.000000 0.000000 0.000000 0.000000 0.000000 0.000000 0.000000 0.000000 0.000000 0.000000 0.000000 0.000000 0.000000 0.000000
elementType: C
elementType: O
elementType: H
dipole: 4.2651 -1.8994 -1.3526
dipole: 4.8609
quadrupole: -231.5756 -209.4079 -212.3870
quadrupole: -14.3468 -0.0254 -7.7114
quadrupole: -13.7855 8.3823 5.4032 -14.3468 -0.0254 -7.7114
hfenergy: -4148.0969842 hartree
pointgroup: C01 [X(C20H26O10Rh2Se1)]
dipole: 1.8176425 -0.5760485 -0.1471557 debye
polarizability: 383.0846359|0.1615097|378.9469143|23.4965077|2.4594205|312.7165524 unknown
InChI: InChI=1S/C9H9O2Se.C3H5.4C2H3O2.2Rh/c1-11-9(10)7-12-8-5-3-2-4-6-8;1-3-2;4*1-2(3)4;;/h2-7H,1H3;3H,1-2H2;4*1H3;;/q;;4*-2;2*+4
charge 0 multiplicity 1
59 atoms
C  1.61940022 1.56405045 0.74835446
Rh -0.63923153 -0.02966916 -0.15752931
Rh -2.79838957 -1.06560892 -0.43551785
O  -1.34773559 0.76269112 1.6120586
O  -1.37652017 1.58905131 -1.22718492
O  -0.0575378 -1.71851967 0.89069121
O  -0.07951647 -0.93378067 -1.95268123
O  -3.39327338 -0.17309752 1.32783178
O  -2.08702103 -2.69508357 0.61882133
O  -2.11613981 -1.90483629 -2.19467131
O  -3.40789528 0.60918034 -1.47391016
C  -2.5498615 0.53758086 1.96247557
C  -2.58175291 1.56155657 -1.63684305
C  -0.89231354 -2.66613346 1.05275657
C  -0.92408455 -1.66256512 -2.5648871
C  -3.00001974 1.15856129 3.26598469
C  -3.078499 2.78844058 -2.37058307
C  -0.42725881 -3.85726196 1.86215126
C  -0.45814526 -2.33109293 -3.84112297
H  -2.60463707 2.17429906 3.34579407
H  -4.08935982 1.1606545 3.33293611
H  -2.59410374 0.57391495 4.09976879
H  -3.20252752 3.60693263 -1.65236834
H  -2.33920746 3.10410295 -3.1121543
H  -4.03620736 2.58598049 -2.85257276
H  0.66218888 -3.92439876 1.85058947
H  -0.76077283 -3.73243803 2.89922946
H  -0.87703602 -4.77392884 1.47331221
H  -0.10653685 -3.34236457 -3.6043251
H  -1.28882394 -2.41969432 -4.54494764
H  0.3659163 -1.77114589 -4.28776376
C  4.74822989 1.82717451 -0.07872709
H  5.50262747 1.1298907 -0.43274418
H  4.47910656 2.61695504 -0.77506642
C  4.52931479 2.01239146 1.2915508
H  4.96703524 1.29034191 1.97912721
C  3.53785119 2.85366429 1.75470781
H  3.18832103 3.67846085 1.14429214
H  3.28340537 2.90695581 2.80897056
C  3.05241045 -0.99061849 0.35257794
C  3.18840311 -1.0872347 1.73944085
C  3.32208375 -2.09529872 -0.46226785
C  3.59946003 -2.29453045 2.3076696
H  2.97621024 -0.23674745 2.37631659
C  3.73768575 -3.29626054 0.11283915
H  3.19366146 -2.02209931 -1.53845721
C  3.87772231 -3.39866522 1.49911154
H  3.7040541 -2.36820181 3.38678993
H  3.94566601 -4.15236436 -0.52310064
H  4.2017722 -4.33418163 1.94665864
Se 2.55567316 0.6319985 -0.55972553
C  0.97915969 2.8213031 0.38598508
O  0.23344076 3.47438903 1.09086196
O  1.38796182 3.24251502 -0.8546788
C  0.75293014 4.43295822 -1.33244898
H  1.2037326 4.63676313 -2.30511839
H  -0.32231044 4.27033187 -1.43648597
H  0.926586 5.26760514 -0.64731852
H  1.34646246 1.08470868 1.67612405
