program: Gaussian 09
title: Rh stay or go opt free ylide proparg
version: EM64L-G09RevB.01
method: UB3LYP
basis: 6-31G(d)
operation: Freq
keyword: #N
keyword: Geom=AllCheck
keyword: Guess=TCheck
keyword: SCRF=Check
keyword: GenChk
keyword: UB3LYP/6-31G(d)
keyword: Freq
multiplicity: 1
elementType: C C C C C H C H C H H H C O O C C H H H C H H H C H H H S C H H C F F F C C H
title: Mulliken atomic charges:
charge: -0.426945 0.150306 -0.147235 -0.174278 -0.134849 0.136443 -0.133460 0.130561 -0.126912 0.129346 0.130102 0.129273 0.686433 -0.535678 -0.521759 0.320056 -0.447793 0.153710 0.139199 0.149767 -0.463569 0.136058 0.187197 0.140433 -0.465161 0.187043 0.136003 0.144445 0.502741 -0.620641 0.217813 0.243039 0.629551 -0.241446 -0.231776 -0.237419 0.390644 -0.469414 0.208172
chargesum: 0.00000
title: Mulliken charges with hydrogens summed into heavy atoms:
elementType: C C C C C C C C O O C C C C S C C F F F C C
charge: -0.426945 0.150306 -0.010792 -0.043717 -0.005502 -0.003358 0.002361 0.686433 -0.535678 -0.521759 0.320056 -0.005117 0.000119 0.002329 0.502741 -0.159789 0.629551 -0.241446 -0.231776 -0.237419 0.390644 -0.261242
charge: 0.000000 0.000000 0.000000 0.000000 0.000000 0.000000 0.000000 0.000000 0.000000 0.000000 0.000000 0.000000 0.000000 0.000000 0.000000 0.000000 0.000000 0.000000 0.000000 0.000000 0.000000 0.000000 0.000000 0.000000 0.000000 0.000000 0.000000 0.000000 0.000000 0.000000 0.000000 0.000000 0.000000 0.000000 0.000000 0.000000 0.000000 0.000000 0.000000
elementType: C
elementType: H
elementType: O
elementType: S
elementType: F
dipole: 1.7349 2.1622 1.4625
dipole: 3.1343
quadrupole: -123.5172 -135.8123 -122.0285
quadrupole: -1.8100 0.7369 -0.4440
quadrupole: 3.6021 -8.6930 5.0908 -1.8100 0.7369 -0.4440
hfenergy: -1467.9669802 hartree
pointgroup: C01 [X(C16H17F3O2S1)]
dipole: 0.7476472 0.7421276 0.640977 debye
polarizability: 195.5659323|-2.1079275|197.6331006|-10.8470542|-3.3621185|188.4136049 unknown
InChI: InChI=1S/C16H17F3O2S/c1-5-11-22(16(17,18)19)13(12-9-7-6-8-10-12)14(20)21-15(2,3)4/h1,6-10H,11H2,2-4H3
charge 0 multiplicity 1
39 atoms
C  0.02294674 -0.2190916 0.01246315
C  0.17088165 1.2613249 0.04859467
C  -0.16355463 1.97984308 1.21018819
C  0.64293606 1.97956355 -1.06282852
C  -0.03370419 3.36719074 1.25693401
H  -0.53142005 1.43567134 2.07494753
C  0.784136 3.36729259 -1.01360667
H  0.88512173 1.44533588 -1.9764715
C  0.44496234 4.06564778 0.14590582
H  -0.30100404 3.90357765 2.16385946
H  1.14969853 3.90272806 -1.88609685
H  0.55053228 5.14670545 0.18362264
C  -1.25038798 -0.93610259 -0.04325821
O  -1.37409505 -2.15295275 -0.13176216
O  -2.28467395 -0.05948895 0.01874134
C  -3.67997187 -0.51419286 -0.03719854
C  -4.46080674 0.80056763 0.05061792
H  -4.20277394 1.45869954 -0.78527506
H  -5.53788096 0.60343814 0.02003079
H  -4.22919709 1.32521034 0.98327134
C  -3.99402596 -1.41101363 1.16613202
H  -5.06477585 -1.64558472 1.18210599
H  -3.42788409 -2.34216185 1.1180242
H  -3.74626239 -0.89304235 2.09953916
C  -3.95599343 -1.21751369 -1.37143785
H  -3.39355018 -2.14902186 -1.4474899
H  -5.02600241 -1.44054434 -1.45569987
H  -3.67799429 -0.56595359 -2.20734195
S  1.32900419 -1.27087694 0.05073859
C  2.61502896 -0.55343054 1.22427038
H  3.56768727 -1.01646831 0.94599696
H  2.66620238 0.52081453 1.02493367
C  2.46921576 -1.05628389 -1.48296371
F  3.15667447 0.09791762 -1.49629856
F  1.70939439 -1.11703421 -2.57544115
F  3.35421176 -2.06663703 -1.49372912
C  2.2416036 -0.84287604 2.59218123
C  1.91051255 -1.08862299 3.72620886
H  1.62390842 -1.31200407 4.7291707
