program: Gaussian 09
title: Rh stay or go opt Rh-bound ylide propargyl
version: EM64L-G09RevB.01
method: UB3LYP
basis: GenECP
operation: Freq
keyword: #N
keyword: Geom=AllCheck
keyword: Guess=TCheck
keyword: SCRF=Check
keyword: GenChk
keyword: UB3LYP/GenECP
keyword: Freq
multiplicity: 1
elementType: C C C C C H C H C H H H Rh Rh O O O O O O O O C C C C C C C C H H H H H H H H H H H H C O O C C H H H C H H H C H H H S C H H C F F F C C H
title: Mulliken atomic charges:
charge: -0.421542 0.099696 -0.169494 -0.164170 -0.133576 0.141758 -0.140689 0.215738 -0.122722 0.129261 0.129622 0.129850 0.407457 0.491425 -0.507949 -0.481507 -0.522302 -0.501755 -0.493731 -0.490145 -0.495776 -0.498649 0.663472 0.664951 0.673372 0.667228 -0.536900 -0.537496 -0.540387 -0.536863 0.184659 0.185212 0.182335 0.180496 0.186457 0.185070 0.184331 0.177264 0.189772 0.185922 0.182363 0.182157 0.677630 -0.499854 -0.452265 0.320187 -0.460893 0.166350 0.141247 0.160660 -0.475180 0.144264 0.183004 0.150440 -0.473982 0.184195 0.138416 0.165809 0.527068 -0.664736 0.288055 0.286199 0.756976 -0.249885 -0.210420 -0.260393 0.391330 -0.463985 0.205548
chargesum: 0.00000
title: Mulliken charges with hydrogens summed into heavy atoms:
elementType: C C C C C C C Rh Rh O O O O O O O O C C C C C C C C C O O C C C C S C C F F F C C
charge: -0.421542 0.099696 -0.027736 0.051568 -0.004316 -0.011067 0.007128 0.407457 0.491425 -0.507949 -0.481507 -0.522302 -0.501755 -0.493731 -0.490145 -0.495776 -0.498649 0.663472 0.664951 0.673372 0.667228 0.015305 0.014527 0.010980 0.013579 0.677630 -0.499854 -0.452265 0.320187 0.007363 0.002527 0.014439 0.527068 -0.090481 0.756976 -0.249885 -0.210420 -0.260393 0.391330 -0.258437
charge: 0.000000 0.000000 0.000000 0.000000 0.000000 0.000000 0.000000 0.000000 0.000000 0.000000 0.000000 0.000000 0.000000 0.000000 0.000000 0.000000 0.000000 0.000000 0.000000 0.000000 0.000000 0.000000 0.000000 0.000000 0.000000 0.000000 0.000000 0.000000 0.000000 0.000000 0.000000 0.000000 0.000000 0.000000 0.000000 0.000000 0.000000 0.000000 0.000000 0.000000 0.000000 0.000000 0.000000 0.000000 0.000000 0.000000 0.000000 0.000000 0.000000 0.000000 0.000000 0.000000 0.000000 0.000000 0.000000 0.000000 0.000000 0.000000 0.000000 0.000000 0.000000 0.000000 0.000000 0.000000 0.000000 0.000000 0.000000 0.000000 0.000000
elementType: C
elementType: H
elementType: O
elementType: S
elementType: F
dipole: -4.6144 -0.7289 -0.7433
dipole: 4.7304
quadrupole: -270.6951 -236.1722 -240.7318
quadrupole: -3.3047 -0.1032 4.2522
quadrupole: -21.4954 13.0275 8.4679 -3.3047 -0.1032 4.2522
hfenergy: -2601.0733054 hartree
pointgroup: C01 [X(C24H29F3O10Rh2S1)]
dipole: -1.8253364 -0.2778677 -0.2335328 debye
polarizability: 399.1869158|-5.3820381|357.6861493|0.0564832|25.8657043|386.5590648 unknown
InChI: InChI=1S/C16H17F3O2S.4C2H3O2.2Rh/c1-5-11-22(16(17,18)19)13(12-9-7-6-8-10-12)14(20)21-15(2,3)4;4*1-2(3)4;;/h1,6-10H,11H2,2-4H3;4*1H3;;/q;4*-2;2*+4
charge 0 multiplicity 1
69 atoms
C  -1.67588945 0.04764855 0.10356389
C  -2.42197091 0.21133089 1.42239361
C  -3.77308119 0.61882149 1.41551071
C  -1.81547386 -0.03866085 2.66121317
C  -4.48492686 0.78799228 2.60019984
H  -4.27285091 0.80922671 0.4684374
C  -2.5294141 0.13555305 3.84977347
H  -0.7838519 -0.36154793 2.69188196
C  -3.86101162 0.54861566 3.82703887
H  -5.52356042 1.1063937 2.5656672
H  -2.03624274 -0.05495079 4.79968485
H  -4.41085989 0.68172247 4.75514986
Rh 0.69239634 -0.00697894 0.08541376
Rh 3.13923985 0.25466037 -0.0254865
O  0.62498954 0.80038924 -1.83185985
O  0.64720179 1.86803197 0.96135396
O  1.02711039 -1.91998596 -0.75311927
O  1.03923784 -0.86939413 1.96577079
O  2.87930668 1.05409369 -1.92028423
O  3.27591514 -1.64209315 -0.84483454
O  3.28653174 -0.57525139 1.85799096
O  2.90030615 2.12175036 0.82441442
C  1.71521354 1.12739941 -2.41184755
C  1.73487331 2.50528521 1.14505798
C  2.2169258 -2.3088929 -1.01636281
C  2.22349589 -0.95169907 2.43382989
C  1.60886595 1.65216614 -3.82988501
C  1.62307913 3.87015919 1.79439684
C  2.35284613 -3.70513056 -1.59085743
C  2.35524756 -1.54601683 3.82148322
H  2.03080973 2.66138146 -3.87641247
H  2.207072 1.01953671 -4.49375475
H  0.57151902 1.66899537 -4.16630091
H  1.762839 4.64311778 1.02966732
H  0.64439816 3.99904179 2.2594498
H  2.41792413 3.99291543 2.53506062
H  1.8750867 -4.42719756 -0.92082849
H  1.83658612 -3.75969292 -2.55586792
H  3.40417197 -3.96259073 -1.72635697
H  3.40102497 -1.75788888 4.04948033
H  1.96449477 -0.83303782 4.55660526
H  1.75725014 -2.45883166 3.89595151
C  -2.06027241 1.10439065 -0.89735429
O  -2.47452865 0.83470226 -2.02632778
O  -1.91834755 2.33284292 -0.40909557
C  -2.26060996 3.54167855 -1.18651035
C  -1.93618071 4.66655758 -0.20073322
H  -0.87848109 4.63826116 0.0762464
H  -2.15582842 5.63851929 -0.6554126
H  -2.53242889 4.56402144 0.71149869
C  -3.7544058 3.5354446 -1.53066121
H  -4.02501041 4.49197612 -1.99213318
H  -3.99866561 2.73114159 -2.22672406
H  -4.3549352 3.41699888 -0.62196383
C  -1.37661048 3.63762871 -2.43227159
H  -1.60864111 2.84223024 -3.14192309
H  -1.53853075 4.60631275 -2.91923252
H  -0.32239902 3.56135426 -2.15106882
S  -2.53818625 -1.44142248 -0.74000299
C  -1.52576724 -1.98507374 -2.21361731
H  -1.34109828 -1.03664486 -2.72302428
H  -0.57796291 -2.37015696 -1.82939272
C  -2.17630173 -2.84205894 0.44861987
F  -3.15253924 -2.85411197 1.35975661
F  -1.00767227 -2.74713005 1.06378594
F  -2.21541738 -3.98896299 -0.2424171
C  -2.27394423 -2.92270235 -3.0248179
C  -2.89391461 -3.69826062 -3.71159055
H  -3.4383353 -4.38584386 -4.31853267
