program: Gaussian 16
title: Title Card Required
version: ES64L-G16RevC.01
method: UB3LYP
basis: GenECP
operation: Freq
keyword: #N
keyword: Geom=AllCheck
keyword: Guess=TCheck
keyword: SCRF=Check
keyword: GenChk
keyword: UB3LYP/GenECPFreq
keyword: UB3LYP/GenECP
keyword: Freq
elementType: O
elementType: C
elementType: H
elementType: F
elementType: Cu
hfenergy: -1750.1465527 hartree
pointgroup: C01[X(C15H12Cu1F6O5)]
dipole: 3.1725629 -0.0879997 2.1622041 debye
polarizability: 302.2400927|16.8208241|244.8604988|32.7172677|-25.2290608|200.3941508 unknown
InChI: InChI=1S/C10H11O3.C5HF6O2.Cu/c1-12-8-10(11)13-7-9-5-3-2-4-6-9;6-4(7,8)2(12)1-3(13)5(9,10)11;/h2-6,8H,7H2,1H3;1H;/q-1;-2;+3
charge 0 multiplicity 2
39 atoms
O  -1.53863074 1.62107029 -0.13118418
C  -2.78301233 1.49127034 -0.28881303
C  -3.539275 0.31905576 -0.43706783
H  -4.60737128 0.41120751 -0.56393101
C  -2.97800688 -0.96738751 -0.42761861
O  -1.7714384 -1.30678015 -0.29620333
C  -3.52981005 2.83955706 -0.31299259
C  -3.92869294 -2.16990883 -0.59256945
F  -3.56893641 -2.90602789 -1.6635507
F  -3.85739435 -2.97021777 0.49157558
F  -5.22118576 -1.82049019 -0.75475395
F  -4.86236528 2.71765331 -0.48151538
F  -3.06244282 3.61340605 -1.3137642
F  -3.32579462 3.5049742 0.84279154
Cu -0.2703659 0.04677666 -0.052922
C  1.99680404 -0.28802168 2.27047002
C  2.43836312 -0.27419143 0.91404153
O  1.68223435 -0.15618636 -0.07725888
O  3.7660741 -0.4119389 0.79706164
C  4.34157555 -0.34449377 -0.54524425
H  3.66767729 -0.84611709 -1.24107338
H  5.26336871 -0.92023444 -0.44916309
C  4.61936987 1.07910692 -0.95897246
C  5.14510682 3.7334339 -1.70165992
C  3.76055957 1.75301776 -1.83742258
C  5.74529114 1.74785849 -0.45742585
C  6.00660721 3.06845625 -0.82398099
C  4.02338335 3.07346072 -2.20919895
H  2.88574004 1.24123064 -2.22817831
H  6.42001818 1.22948929 0.21989684
H  6.88330227 3.57606431 -0.4312134
H  3.35318503 3.58497359 -2.89452753
H  5.3499596 4.76047635 -1.99125959
O  0.68544495 -0.17654939 2.4789519
C  0.23853154 -0.17836216 3.85021116
H  0.52732305 -1.11543114 4.33427481
H  0.66739944 0.67574817 4.38150664
H  -0.84607132 -0.09238654 3.80933363
H  2.67766651 -0.3863966 3.10802877
