program: Gaussian 16
title: IP1'-2a'-TS
version: ES64L-G16RevC.01
method: UB3LYP
basis: GenECP
operation: Freq
keyword: #N
keyword: Geom=AllCheck
keyword: Guess=TCheck
keyword: SCRF=Check
keyword: GenChk
keyword: UB3LYP/GenECP
keyword: Freq
elementType: C
elementType: O
elementType: H
elementType: N
elementType: S
elementType: Cu
elementType: F
hfenergy: -2971.3881775 hartree
pointgroup: C01 [X(C31H26Cu1F6N1O7S1)]
dipole: 5.545124 0.8970221 3.5778786 debye
polarizability: 656.6397639|-11.3663403|489.5036486|-0.8929038|-11.9053515|444.3557097 unknown
InChI: InChI=1S/C16H14NO2S.C10H11O3.C5HF6O2.Cu/c1-12-7-9-14(10-8-12)20(18,19)17-11-13(2)15-5-3-4-6-16(15)17;1-12-8-10(11)13-7-9-5-3-2-4-6-9;6-4(7,8)2(12)1-3(13)5(9,10)11;/h3-11H,2H2,1H3;2-6,8H,7H2,1H3;1H;/q;;-2;+2
charge 1 multiplicity 2
73 atoms
C  1.57888169 3.39403854 -1.18588622
C  0.2633163 3.62717948 -1.72773565
O  -0.03856965 3.78115771 -2.90886338
O  -0.65224642 3.66063422 -0.71019374
C  -2.00631566 4.01980239 -1.1047661
H  -2.36457756 3.29716778 -1.84284536
H  -1.96865572 5.00319468 -1.58373095
C  2.71624077 3.1901041 -3.32228063
H  3.76182356 3.03814201 -3.58842362
H  2.33922174 4.1237459 -3.73961852
H  2.10691585 2.35455883 -3.67152442
O  2.70993333 3.24503196 -1.87791547
H  1.7373049 3.39058072 -0.11432954
C  0.45824308 0.02231672 1.33892292
C  1.06367851 -0.98567248 2.22825424
C  1.28158964 0.01220166 0.14327202
C  -0.60291236 0.90392845 1.54364719
C  0.75461675 -1.43606653 3.5107158
C  2.16421207 -1.534468 1.53989123
H  1.18700877 0.62530499 -0.74417613
N  2.24983628 -0.87267058 0.27663218
H  -0.77973951 1.72847365 0.8546753
H  -1.09855474 0.95295302 2.50913376
H  -0.08442698 -1.02601224 4.06375179
C  1.55587615 -2.43592819 4.06768358
C  2.96279043 -2.53848053 2.07307707
C  2.63604344 -2.9798494 3.35863427
H  1.33491621 -2.80073659 5.06533662
H  3.78852966 -2.97425099 1.5257266
H  3.23414201 -3.76269729 3.8131293
S  3.47229967 -1.17177921 -1.06634845
O  3.59753283 -2.6206389 -1.0877186
O  2.89363221 -0.40252169 -2.15923907
C  4.93134755 -0.40847622 -0.43732784
C  5.06499939 0.98478813 -0.52381221
C  5.93744353 -1.21965221 0.09901972
C  6.23430385 1.56245541 -0.04474992
H  4.28464879 1.60231587 -0.95693284
C  7.09885622 -0.61145483 0.5663818
H  5.82494045 -2.29708388 0.13284906
C  7.26657829 0.78057427 0.50503738
H  6.35237161 2.64054717 -0.10292862
H  7.88848232 -1.23017578 0.98161887
C  8.53630291 1.42890963 0.99244138
H  9.10744931 0.75783847 1.63954407
H  8.32407645 2.35073556 1.54373168
H  9.17674014 1.69997824 0.14329448
C  -2.86595869 4.02570799 0.13016722
C  -2.7464597 5.05585278 1.07499424
C  -3.79118423 2.99968293 0.35589248
C  -3.53499442 5.05504433 2.22552696
H  -2.03424439 5.85975986 0.90545404
C  -4.58365388 2.99675543 1.50740731
H  -3.8992175 2.19812624 -0.36850628
C  -4.45569272 4.02417268 2.44391481
H  -3.43695543 5.85967372 2.94911926
H  -5.29399551 2.19068079 1.66621615
H  -5.07252174 4.02675683 3.3384682
Cu -1.37459798 -0.71888295 0.52976675
O  -1.39939049 -2.39291918 -0.46993618
C  -2.48185735 -2.91218702 -0.87142203
C  -3.7892673 -2.43119953 -0.7185527
H  -4.60204241 -3.00678359 -1.13507985
C  -4.08832812 -1.23526012 -0.05895522
O  -3.30088229 -0.41858212 0.50834487
C  -2.26649241 -4.24272445 -1.61682648
C  -5.55599133 -0.77066382 -0.00095239
F  -5.90005492 -0.46775971 1.26439075
F  -5.70376235 0.34678476 -0.74375201
F  -6.41900687 -1.69057662 -0.46036958
F  -1.66728185 -5.12967616 -0.80101547
F  -3.41334582 -4.78984059 -2.05581959
F  -1.46394436 -4.04788949 -2.6786643
