program: Gaussian 16
title: Cu-C-enolate CuCl2 Cheong int form 2,3
version: ES64L-G16RevC.01
method: UB3LYP
basis: GenECP
operation: Freq
keyword: #N
keyword: Geom=AllCheck
keyword: Guess=TCheck
keyword: SCRF=Check
keyword: GenChk
keyword: UB3LYP/GenECP
keyword: Freq
elementType: H
elementType: C
elementType: N
elementType: S
elementType: O
elementType: Cu
elementType: Cl
hfenergy: -2951.3843935 hartree
pointgroup: C01 [X(C26H25Cl2Cu1N1O5S1)]
dipole: -3.7449234 3.8728197 -2.0867928 debye
polarizability: 534.1403396|-16.5815467|617.1376702|39.5516467|-85.2621351|488.1223592 unknown
InChI: InChI=1S/C16H14NO2S.C10H11O3.2ClH.Cu/c1-12-7-9-14(10-8-12)20(18,19)17-11-13(2)15-5-3-4-6-16(15)17;1-12-8-10(11)13-7-9-5-3-2-4-6-9;;;/h3-11H,2H2,1H3;2-6,8H,7H2,1H3;2*1H;/q;;;;+2/p-2
charge 0 multiplicity 2
61 atoms
H  0.33567656 -1.641791 -3.66288915
C  -0.59617351 -1.11661928 -3.47959618
C  -3.05191026 0.26090706 -3.01399871
C  -0.72108994 -0.23662755 -2.40092473
C  -1.698449 -1.30776243 -4.31167035
C  -2.90519191 -0.62673227 -4.08175159
C  -1.94634081 0.42960757 -2.18431272
H  -1.62241926 -1.98933659 -5.15289264
H  -3.74526026 -0.78822655 -4.75003347
N  -1.78691029 1.24112878 -1.02952322
S  -3.05011488 2.11793011 -0.17007317
O  -2.30184473 2.85376561 0.84677666
O  -3.81043845 2.81119878 -1.2090501
C  -0.5064971 1.15780158 -0.57134206
H  -0.2387269 1.54836572 0.3994799
C  0.20143987 0.18294426 -1.34952596
C  1.46582244 -0.28585863 -1.0556727
H  1.97289505 -0.96579801 -1.73032742
C  -4.03266768 0.83117164 0.54683694
C  -5.61425805 -1.14193192 1.71863976
C  -5.35514618 0.67954218 0.12194303
C  -3.47936482 0.02422636 1.54986213
C  -4.27915391 -0.95814771 2.12151561
C  -6.13591066 -0.30853212 0.71886648
H  -5.76550494 1.32497339 -0.64612276
H  -2.44906934 0.14252242 1.87206877
H  -3.85957986 -1.59332149 2.89638999
H  -7.1671726 -0.43086715 0.40112273
C  -6.45547078 -2.22574186 2.34419182
H  -6.13312572 -3.2144504 1.99386021
H  -7.51318698 -2.10924518 2.09241523
H  -6.35578176 -2.22298435 3.43502861
C  0.42125571 3.25199969 -1.64116789
H  -0.20342666 3.83226709 -0.96690608
O  0.0866072 3.14200287 -2.91041674
C  -1.10395945 3.82983565 -3.36606955
H  -1.9261257 3.69993416 -2.65992671
H  -1.35419081 3.38292757 -4.32675968
H  -0.86734526 4.88988362 -3.48912097
C  3.48217365 3.35374401 0.38781571
H  4.08779467 3.70199137 -0.45064243
H  3.4920378 4.10150788 1.18222582
C  3.9599152 2.01528047 0.89189195
C  4.88676389 -0.45147063 1.85825278
C  3.66387922 1.60808886 2.20075933
C  4.7265913 1.1743224 0.07212812
C  5.18910321 -0.05248409 0.55317411
C  4.12269191 0.38069696 2.68170075
H  3.07862321 2.25810915 2.84661621
H  4.95346594 1.48332005 -0.94390463
H  5.78718854 -0.69386432 -0.08811525
H  3.88914163 0.07669925 3.69792157
H  5.24983742 -1.40392897 2.23428508
C  1.83897953 3.0094537 -1.3218522
O  2.65722467 2.57274529 -2.11208871
O  2.08119211 3.34425787 -0.03935707
H  -3.97998467 0.79470098 -2.85160334
H  2.06529422 0.1814705 -0.28100576
Cu 0.92356379 -2.01583791 0.47101932
Cl 1.56702899 -3.68222724 -0.83960609
Cl 0.1650421 -0.90176232 2.25058242
