program: Gaussian 16
title: Title Card Required
version: ES64L-G16RevC.01
method: UB3LYP
basis: GenECP
operation: Freq
keyword: #N
keyword: Geom=AllCheck
keyword: Guess=TCheck
keyword: SCRF=Check
keyword: GenChk
keyword: UB3LYP/GenECPFreq
keyword: UB3LYP/GenECP
keyword: Freq
elementType: Cu
elementType: O
elementType: C
elementType: H
elementType: F
hfenergy: -1136.5267723 hartree
pointgroup: C01 [X(C5H1Cu1F6O2)]
dipole: 2.8668273 0.0010023 0.0217547 debye
dipolederiv: 1.0062426 0.0001542 -0.000338 0.0001498 0.8410275 -0.0121503 -0.0003329 -0.0126976 1.0507569 -0.6836487 -0.6914687 -0.0422573 -0.0984673 -0.5362643 -0.0136458 -0.0077106 -0.0185911 -0.329491 0.4001988 0.8632299 0.0528544 0.3832908 0.7088046 0.0318394 0.025056 0.0436745 0.2161832 -0.0522144 0.0008632 0.0015004 0.0008777 -1.2510906 -0.0610079 0.0015091 -0.0591773 -0.2487496 0.1588599 -0.0000368 -0.0001423 -0.0000374 0.2109964 0.0015249 -0.0001493 0.0023561 0.1777402 0.4022048 -0.8640064 -0.050117 -0.3839429 0.7079322 0.0260283 -0.0223134 0.03067 0.2150575 -0.6848724 0.6915642 0.0369409 0.0985593 -0.5357118 -0.0121401 0.0023667 -0.0081822 -0.3288191 1.8358435 -0.4112208 -0.0224995 -0.4115719 2.4421899 0.0394273 -0.0249123 0.0402472 1.7059719 1.8345312 0.4101373 0.0244259 0.4105109 2.4427598 0.0456552 0.026864 0.0465309 1.7067213 -0.3148091 -0.0216606 0.0897318 -0.0975945 -0.7252673 -0.2963125 0.0383703 -0.3633247 -0.7094665 -0.3149004 -0.0007317 -0.0976728 -0.0810581 -0.8103174 0.2864709 -0.0596394 0.3426764 -0.6058983 -0.9785192 -0.1943863 -0.0026211 -0.0544744 -0.4798906 -0.0146841 0.006549 -0.0134275 -0.2675112 -0.3174031 -0.0041176 0.1018488 0.077045 -0.8102344 0.2877314 0.0637752 0.3427034 -0.6034614 -0.9784669 0.1942121 -0.0081523 0.0543452 -0.47972 -0.0138631 -0.0173343 -0.0104826 -0.267735 -0.3130466 0.0274682 -0.0835021 0.1023679 -0.7252141 -0.2948736 -0.0320981 -0.3629756 -0.711299 unknown
polarizability: 105.5102181|-0.0414219|123.6174946|0.4398777|4.6545645|47.0433672 unknown
InChI: InChI=1S/C5HF6O2.Cu/c6-4(7,8)2(12)1-3(13)5(9,10)11;/h1H;/q-2;+2
charge 1 multiplicity 2
15 atoms
Cu -0.1240078 -0.00021151 0.0194188
O  -1.34463946 1.41009775 0.09244112
C  -2.60536252 1.21691416 0.07228108
C  -3.28285464 -0.00131802 -0.00438999
H  -4.36294032 -0.00169255 -0.01253264
C  -2.60343353 -1.21907087 -0.07091319
O  -1.34241448 -1.41136896 -0.07208859
C  -3.40719475 2.54484731 0.14997939
C  -3.40306245 -2.54756276 -0.16080012
F  -3.08967565 -3.15921933 -1.30541056
F  -3.06248711 -3.326908 0.86769396
F  -4.71749534 -2.31962731 -0.12720284
F  -3.05160367 3.32441479 -0.87325127
F  -4.72080532 2.31597754 0.09644492
F  -3.11165196 3.15675076 1.29919392
