program: Gaussian 16
title: Volga benzyl cation radical
version: ES64L-G16RevC.01
method: UB3LYP
basis: 6-31G(d)
operation: Freq
keyword: #N
keyword: Geom=AllCheck
keyword: Guess=TCheck
keyword: SCRF=Check
keyword: GenChk
keyword: UB3LYP/6-31G(d)
keyword: Freq
elementType: H
elementType: C
elementType: N
elementType: S
elementType: O
hfenergy: -1221.422863 hartree
pointgroup: C01 [X(C16H14N1O2S1)]
dipole: -1.0647072 1.789723 1.2562901 debye
polarizability: 234.2968951|9.7505023|211.6420432|15.8712336|-34.618204|225.194141 unknown
InChI: InChI=1S/C16H14NO2S/c1-12-7-9-14(10-8-12)20(18,19)17-11-13(2)15-5-3-4-6-16(15)17/h3-11H,2H2,1H3
charge 0 multiplicity 2
34 atoms
H  3.94342911 1.88902176 1.54933628
C  3.32899417 1.64500296 0.68703002
C  1.74632293 1.00642578 -1.58548208
C  2.54608784 0.48713761 0.67924613
C  3.30911638 2.48111736 -0.42744484
C  2.52598503 2.16256366 -1.54806434
C  1.76466863 0.18641384 -0.45680118
H  3.91139719 3.38509377 -0.43361571
H  2.53281123 2.82191095 -2.41139845
C  2.352147 -0.58162566 1.66756599
C  1.44744864 -1.47519951 1.08070317
H  1.05500124 -2.40847959 1.45393236
N  1.11315784 -1.0479602 -0.21021144
S  -0.32797552 -1.58396033 -0.98183537
O  -0.14536579 -1.3090388 -2.40641232
O  -0.52973422 -2.94190789 -0.47753427
C  -1.62718237 -0.53496426 -0.35214846
C  -3.62198501 1.13590121 0.67142356
C  -2.22147663 -0.8467452 0.8747411
C  -2.01369011 0.59478521 -1.07641603
C  -3.00912413 1.41996591 -0.55704493
C  -3.21206559 -0.00748883 1.37540712
H  -1.92345419 -1.73688744 1.41791628
H  -1.55419002 0.81393345 -2.03344819
H  -3.31596685 2.2984597 -1.11840235
H  -3.67878751 -0.24631607 2.32750267
C  -4.7184918 2.0200429 1.21327635
H  -5.70685459 1.61305716 0.96258612
H  -4.66318889 3.02931219 0.79437332
H  -4.66698324 2.09700251 2.30426037
C  2.95641044 -0.6983773 2.91661646
H  3.65771985 0.04686438 3.27453084
H  2.74503083 -1.54179413 3.56488882
H  1.16498608 0.74620193 -2.461368
