program: Gaussian 16
title: Molecule Name
version: ES64L-G16RevC.01
method: RB3LYP
basis: 6-31G(d)
operation: Freq
keyword: #N
keyword: Geom=AllCheck
keyword: Guess=TCheck
keyword: SCRF=Check
keyword: GenChk
keyword: RB3LYP/6-31G(d)Freq
keyword: RB3LYP/6-31G(d)
keyword: Freq
hfenergy: -1834.728673 hartree
pointgroup: C01 [X(C26H25N1O5S1)]
dipole: 2.0221694 0.9745261 1.9784688 debye
polarizability: 461.13461|-61.2744082|396.4849043|15.6539602|-29.1928692|271.1802513 unknown
InChI: InChI=1S/C16H14NO2S.C10H11O3/c1-12-7-9-14(10-8-12)20(18,19)17-11-13(2)15-5-3-4-6-16(15)17;1-12-8-10(11)13-7-9-5-3-2-4-6-9/h3-11H,2H2,1H3;2-6,8H,7H2,1H3
charge 0 multiplicity 1
58 atoms
H  -0.97519761 1.44138845 3.65313083
C  -0.41833006 0.71074289 3.07311002
C  1.01480997 -1.21502935 1.55885311
C  -0.01145889 1.00331742 1.77044143
C  -0.10610101 -0.5359404 3.61693474
C  0.59864296 -1.48544535 2.86607273
C  0.70937821 0.03819135 1.03812643
H  -0.42083382 -0.7761449 4.62821785
H  0.82363714 -2.45525222 3.30037284
C  -0.16714632 2.19115481 0.92676244
C  0.38117255 1.8418074 -0.36870545
H  0.81124683 2.542104 -1.06774432
N  1.02503239 0.60585841 -0.22580304
S  1.91260863 -0.1354036 -1.48090606
O  1.38489119 -1.48865548 -1.66592236
O  1.91476549 0.84532802 -2.56545697
C  3.56138917 -0.26812596 -0.80137133
C  6.16993651 -0.4735556 0.18595986
C  4.30013844 0.89550173 -0.56384326
C  4.10918972 -1.52943068 -0.56968276
C  5.41105167 -1.62091458 -0.07711501
C  5.5948113 0.78277623 -0.06974683
H  3.87388574 1.87200291 -0.76979916
H  3.52984632 -2.42067353 -0.78393677
H  5.84281602 -2.60213615 0.10079809
H  6.17328577 1.68399331 0.11574347
C  7.56726263 -0.57683094 0.74654105
H  7.9960823 -1.56854675 0.57480733
H  7.56626587 -0.40013775 1.83002905
H  8.23314861 0.16807204 0.29820584
C  -0.88878202 3.32325339 1.1469335
H  -1.39383028 3.49835312 2.09167893
H  -0.84958616 4.15322564 0.45244276
C  -2.98293459 2.79481585 -0.69243973
H  -2.61619758 3.72435204 -1.11501364
O  -4.26012729 2.76898762 -0.22337654
C  -4.78974699 4.04286342 0.11740549
H  -5.83186921 3.88351045 0.40029657
H  -4.74713845 4.73448507 -0.73562293
H  -4.24395523 4.48269192 0.96344388
C  -2.27461335 1.63565359 -0.8974399
O  -1.11323528 1.62673935 -1.4698609
O  -2.79398933 0.48644881 -0.36443979
C  -2.38343885 -0.73936606 -0.98425374
H  -1.35142484 -0.98214457 -0.70990975
H  -2.40339439 -0.61620741 -2.07565768
C  -3.31956948 -1.84559151 -0.55584175
C  -5.04878807 -3.95204803 0.12578088
C  -2.85801411 -3.16742933 -0.53497155
C  -4.65544776 -1.58749479 -0.22601355
C  -5.51275647 -2.63479568 0.11582461
C  -3.71711107 -4.21575133 -0.20204894
H  -1.81866891 -3.37568067 -0.78008541
H  -5.01057973 -0.56217342 -0.22653083
H  -6.54662434 -2.4205302 0.37514687
H  -3.34385921 -5.23667183 -0.19043193
H  -5.71813374 -4.76623205 0.39140114
H  1.54161899 -1.96140511 0.97707415
