program: Gaussian 16
title: Title Card Required
version: ES64L-G16RevC.01
method: RB3LYP
basis: 6-31G(d)
operation: Freq
keyword: #N
keyword: Geom=AllCheck
keyword: Guess=TCheck
keyword: SCRF=Check
keyword: GenChk
keyword: RB3LYP/6-31G(d)
keyword: Freq
hfenergy: -109.5241287 hartree
pointgroup: D*H [C*(N1.N1)]
dipole: 0. 0. 0. debye
dipolederiv: 0. 0. 0. 0. 0. 0. 0. 0. 0. 0. 0. 0. 0. 0. 0. 0. 0. 0. unknown
polarizability: 13.3337694|0.|6.1378891|0.|0.|6.1378891 unknown
InChI: InChI=1S/N2/c1-2
charge 0 multiplicity 1
2 atoms
N  -1.7099491 0.15947467 0.0000
N  -2.81544672 0.15947467 0.0000
