program: Gaussian 16
title: Molecule Name
version: ES64L-G16RevA.03
method: RB3LYP
basis: 6-31G(d)
operation: Freq
keyword: #N
keyword: Geom=AllCheck
keyword: Guess=TCheck
keyword: SCRF=Check
keyword: GenChk
keyword: RB3LYP/6-31G(d)
keyword: Freq
title: Mulliken charges:
elementType: H C C C C C C H H C C H N S O O C C C C C C H H H H C H H H C H H C H O C H H H C O O C H H C C C C C C H H H H H H
charge: 0.153769 -0.217540 -0.168767 0.083689 -0.143358 -0.159980 0.314676 0.147072 0.150908 0.118581 0.113198 0.206170 -0.696745 1.273938 -0.559117 -0.548807 -0.160382 0.177355 -0.137430 -0.141625 -0.183096 -0.178479 0.183050 0.188041 0.160309 0.160756 -0.533398 0.172562 0.183239 0.175962 -0.415321 0.173238 0.173332 0.037122 0.154049 -0.455587 -0.215793 0.175680 0.158978 0.158177 0.567401 -0.555394 -0.510806 -0.103722 0.165293 0.161770 0.119212 -0.142274 -0.194195 -0.175892 -0.146137 -0.143144 0.142030 0.146433 0.141251 0.141458 0.140329 0.167961
chargesum: -0.00000
title: Mulliken charges with hydrogens summed into heavy atoms:
elementType: C C C C C C C C N S O O C C C C C C C C C O C C O O C C C C C C C
charge: -0.063771 -0.000807 0.083689 0.003714 -0.009072 0.314676 0.118581 0.319368 -0.696745 1.273938 -0.559117 -0.548807 -0.160382 0.177355 0.045620 0.046417 -0.022786 -0.017724 -0.001636 -0.068751 0.191171 -0.455587 0.277042 0.567401 -0.555394 -0.510806 0.223341 0.119212 -0.001945 -0.052165 -0.029459 -0.004887 -0.001685
chargesum: 0.00000
dipole: 5.6998 2.5654 5.9682
dipole: 8.6423
quadrupole: -150.1979 -164.4922 -205.9598
quadrupole: -13.8091 3.4786 1.3922
quadrupole: 23.3521 9.0578 -32.4098 -13.8091 3.4786 1.3922
hfenergy: -1834.7372773 hartree
pointgroup: C01 [X(C26H25N1O5S1)]
dipole: 2.3153241 0.1326418 2.4864714 debye
polarizability: 495.6464674|-79.5355196|477.0596452|-7.4534303|14.7630776|301.6761867 unknown
InChI: InChI=1S/C16H14NO2S.C10H11O3/c1-12-7-9-14(10-8-12)20(18,19)17-11-13(2)15-5-3-4-6-16(15)17;1-12-8-10(11)13-7-9-5-3-2-4-6-9/h3-11H,2H2,1H3;2-6,8H,7H2,1H3
charge 0 multiplicity 1
58 atoms
H  -1.01639129 0.13107225 4.02188641
C  -0.51584332 -0.40464105 3.22021216
C  0.77621835 -1.8192267 1.12455275
C  -0.07890122 0.27281898 2.08036468
C  -0.30326947 -1.78126598 3.31308342
C  0.33230436 -2.47700584 2.27633938
C  0.56996509 -0.44513475 1.05534197
H  -0.64004663 -2.31938621 4.19415808
H  0.48232628 -3.54933193 2.36077925
C  -0.13570028 1.68253303 1.68240512
C  0.39647381 1.74450922 0.33586052
H  0.88513825 2.60438174 -0.09485729
N  0.93356027 0.48555819 0.04355384
S  1.79803198 0.14370095 -1.38619796
O  1.18877727 -1.03982806 -1.99924973
O  1.85741966 1.42040799 -2.10045848
C  3.42947461 -0.29296701 -0.8086789
C  6.00975031 -0.95418643 0.04094003
C  4.24000876 0.6963077 -0.24042302
C  3.89051064 -1.59948489 -0.97257292
C  5.17949777 -1.91841567 -0.54532905
C  5.52038791 0.35607764 0.18098147
H  3.88196265 1.71528096 -0.13634383
H  3.25801859 -2.34799278 -1.43648288
H  5.5438578 -2.93370116 -0.67474186
H  6.15455216 1.1205 0.6216647
C  7.39259013 -1.31044132 0.52764856
H  7.74909538 -2.24088661 0.07648946
H  7.39685881 -1.44668752 1.61682557
H  8.11165759 -0.51690978 0.298864
C  -0.75977324 2.73064759 2.28340567
H  -1.25446996 2.62142877 3.24345064
H  -0.65229092 3.73766163 1.90016347
C  -2.88335776 3.02082916 0.40036879
H  -2.43489581 4.00449877 0.31153526
O  -4.15969614 2.94267189 0.866291
C  -4.58946971 4.08182497 1.60651689
H  -5.64038221 3.91744591 1.85040505
H  -4.49261432 5.00057721 1.01293887
H  -4.00975964 4.1881519 2.53274616
C  -2.2698611 1.9421266 -0.18657209
O  -1.10864617 2.02461763 -0.7546487
O  -2.88585565 0.722382 -0.04700602
C  -2.58948439 -0.24991705 -1.06005253
H  -1.56752387 -0.62626716 -0.94675981
H  -2.64848849 0.23025046 -2.04668297
C  -3.5857143 -1.3812604 -0.95911952
C  -5.43702712 -3.49439179 -0.89207046
C  -3.18695194 -2.68742035 -1.26753424
C  -4.92183371 -1.1441646 -0.61047655
C  -5.84007536 -2.19459285 -0.57374134
C  -4.10683333 -3.73797751 -1.2404337
H  -2.14939147 -2.8834893 -1.52871468
H  -5.2317278 -0.13538595 -0.35609303
H  -6.8726356 -1.99787505 -0.29667511
H  -3.78158738 -4.74650147 -1.48214281
H  -6.15327136 -4.31128955 -0.86404819
H  1.25142291 -2.36759803 0.32048334
