program: Gaussian 16
title: Volga A prime dias TSS conf 1
version: ES64L-G16RevA.03
method: RB3LYP
basis: 6-31G(d)
operation: Freq
keyword: #N
keyword: Geom=AllCheck
keyword: Guess=TCheck
keyword: SCRF=Check
keyword: GenChk
keyword: RB3LYP/6-31G(d)
keyword: Freq
title: Mulliken charges:
elementType: H C C C C C C H H N S O O C H C C H H C C C C C C H H H H C H H H C H O C H H H C H H C C C C C C H H H H H C O O H
charge: 0.151201 -0.218377 -0.165103 0.075175 -0.146782 -0.165791 0.288287 0.143838 0.146952 -0.680494 1.250132 -0.555813 -0.553134 -0.013949 0.205080 0.061720 -0.142689 0.169900 0.170244 -0.148388 0.176952 -0.141224 -0.141801 -0.179606 -0.182786 0.185978 0.184689 0.160509 0.160448 -0.533309 0.183565 0.173009 0.175223 0.036674 0.148469 -0.469171 -0.212247 0.154098 0.170194 0.158611 -0.113187 0.157847 0.163947 0.131227 -0.140233 -0.195260 -0.177636 -0.145739 -0.142313 0.140949 0.152844 0.144433 0.143892 0.143515 0.507941 -0.514557 -0.511437 0.173483
chargesum: -0.00000
title: Mulliken charges with hydrogens summed into heavy atoms:
elementType: C C C C C C N S O O C C C C C C C C C C C O C C C C C C C C C O O
charge: -0.067176 0.008380 0.075175 -0.002944 -0.018839 0.288287 -0.680494 1.250132 -0.555813 -0.553134 0.191131 0.061720 0.197455 -0.148388 0.176952 0.044754 0.042887 -0.019097 -0.022338 -0.001512 0.185143 -0.469171 0.270656 0.208607 0.131227 0.003282 -0.054310 -0.024792 -0.001307 0.001579 0.507941 -0.514557 -0.511437
dipole: -4.4276 -2.1520 -5.2258
dipole: 7.1794
quadrupole: -161.3033 -175.4857 -200.6821
quadrupole: 5.5347 18.6763 11.6417
quadrupole: 17.8537 3.6713 -21.5251 5.5347 18.6763 11.6417
hfenergy: -1834.7723702 hartree
pointgroup: C01 [X(C26H25N1O5S1)]
dipole: -1.7420146 -0.8460234 -2.0562206 debye
polarizability: 398.2455733|-51.3588618|416.6742655|29.5443628|18.2665739|333.5378772 unknown
InChI: InChI=1S/C26H25NO5S/c1-20-12-14-23(15-13-20)33(28,29)27-16-22(24-10-6-7-11-25(24)27)18-32-26(19-30-2)31-17-21-8-4-3-5-9-21/h3-16,19H,17-18H2,1-2H3
charge 0 multiplicity 1
58 atoms
H  -0.2838628 2.75467857 -2.77162025
C  -1.03771121 2.69197404 -1.99261926
C  -2.98289993 2.56117625 0.08526614
C  -1.03806703 1.61437792 -1.09374192
C  -2.01059698 3.67709214 -1.85894189
C  -2.97089706 3.60954175 -0.83276
C  -2.01058782 1.56926993 -0.06432861
H  -2.02558561 4.5157816 -2.54920144
H  -3.71442952 4.39636809 -0.74366141
N  -1.74333319 0.41246685 0.6969656
S  -2.8053092 -0.34786636 1.8069281
O  -1.98934034 -1.37634767 2.45415638
O  -3.42190085 0.73224021 2.5781699
C  -0.65472496 -0.25706832 0.11905895
H  -0.29748603 -1.17550662 0.56040691
C  -0.19540614 0.44363839 -0.95539077
C  0.96739867 0.0777205 -1.81905553
H  1.38291115 -0.89006727 -1.5217163
H  0.67711335 0.02381884 -2.8721388
C  -4.05441935 -1.13590153 0.80818331
C  -5.99616845 -2.36749272 -0.7812086
C  -5.26648113 -0.4814709 0.57782562
C  -3.79634896 -2.39903963 0.26554225
C  -4.77046128 -3.00300893 -0.52318081
C  -6.22786706 -1.10601954 -0.21461108
H  -5.46224863 0.48639867 1.02499812
H  -2.86020175 -2.90672557 0.47099525
H  -4.57909463 -3.98801457 -0.94011804
H  -7.17605877 -0.60530821 -0.38959117
C  -7.03112425 -3.02396225 -1.66105235
H  -6.8042516 -2.85030856 -2.72099796
H  -8.03142677 -2.62503428 -1.4688828
H  -7.0549233 -4.10777693 -1.50839346
C  2.80500025 2.23217643 0.09901762
H  2.14397071 3.06909569 -0.11500445
O  3.71696523 2.3894317 1.10859295
C  3.22406138 3.13519111 2.22033021
H  2.85403521 4.1197977 1.90282006
H  4.06468718 3.26925543 2.90393101
H  2.4159486 2.59811257 2.73293807
C  4.49704734 -0.35915832 -1.30284136
H  4.05126315 -0.92166128 -2.1312487
H  4.92615113 0.56373657 -1.71464978
C  5.55347209 -1.17728856 -0.60299092
C  7.57483287 -2.65065683 0.67039461
C  6.02402335 -2.36856868 -1.16485914
C  6.10069113 -0.73078172 0.60853554
C  7.10275962 -1.46453914 1.24218595
C  7.03428851 -3.10085699 -0.53496438
H  5.59859019 -2.72714485 -2.09947801
H  5.72503448 0.18732256 1.05150312
H  7.51803986 -1.11150816 2.18251685
H  7.39097093 -4.02475127 -0.98242662
H  8.35678163 -3.22090261 1.16472167
C  2.76050232 1.12259083 -0.64816034
O  2.01257919 1.08873464 -1.79826646
O  3.47435121 0.00132216 -0.34223413
H  -3.7065341 2.5286021 0.89049953
