program: ADF
programVersion: 2019
title: Phosphorus (TZP, 2p frozen)
runtype: GEOMETRY OPTIMIZATION
method: DFT
functional: Becke88 Perdew86
basis: TZP
functional: VWN
spinMolecule: Restricted
epsl: 78.39000
zeropoint: 7.367547 electronvolt
frequency: -14.324 16.943 29.416 37.294 43.251 63.027 67.627 71.372 73.370 82.330 89.366 99.511 102.503 113.896 118.654 127.439 132.550 135.321 140.817 150.259 155.804 159.732 171.874 179.598 183.865 187.033 195.807 204.203 219.021 223.949 235.449 251.117 256.494 266.881 268.439 279.839 280.951 286.624 297.824 338.224 340.691 350.671 365.228 369.002 372.243 391.929 404.622 408.749 437.969 449.631 453.367 465.608 468.623 495.520 511.068 522.128 529.760 538.915 588.880 595.049 604.763 616.153 618.604 624.643 631.396 654.672 686.845 690.845 697.054 718.340 730.648 739.471 750.171 766.440 784.660 792.203 816.094 822.153 828.195 830.501 849.258 852.610 881.105 884.966 902.289 923.856 939.881 941.412 942.418 966.067 993.479 1089.953 1100.719 1102.669 1142.504 1247.200 1249.477 1250.248 1283.716 1287.555 1331.146 1360.900 1459.947 1487.881 1501.496 1560.000 1577.700 1587.171 1633.588 1660.152 3006.112 3049.846 3088.760 3111.896 3124.613 3133.634 3164.373 3228.274 3287.043 3378.080 3379.791 3454.813 3638.456 3650.125 3664.428 3693.771
elementType: W O O O O O O W O O H H H H O C C H C H C N O O C H C H P O O O O H H O H H O H H O H H
frequency: -14.323878 16.942622 29.415654 37.294201 43.250849 63.026528 67.627140 71.371815 73.369853 82.329979 89.366061 99.511329 102.502966 113.896283 118.653653 127.439382 132.549659 135.321032 140.816937 150.259036 155.803554 159.732273 171.874343 179.597863 183.864901 187.032684 195.807177 204.203458 219.020842 223.949012 235.448986 251.117241 256.493695 266.880559 268.438626 279.838760 280.951474 286.623729 297.823971 338.224207 340.691337 350.670734 365.227880 369.002078 372.242891 391.928756 404.621721 408.749313 437.969265 449.631045 453.367490 465.608412 468.622517 495.519704 511.067850 522.127792 529.759955 538.915361 588.880008 595.048617 604.763108 616.153462 618.604466 624.642905 631.395671 654.672251 686.844567 690.845238 697.053961 718.339984 730.648298 739.471215 750.170956 766.440249 784.659786 792.203452 816.093735 822.152871 828.195136 830.501432 849.257835 852.610359 881.104644 884.966363 902.288503 923.856176 939.881375 941.411677 942.417871 966.066799 993.479047 1089.952899 1100.718672 1102.669087 1142.503749 1247.200096 1249.476701 1250.248084 1283.716000 1287.555247 1331.145851 1360.899638 1459.946525 1487.880624 1501.495894 1559.999605 1577.700346 1587.170616 1633.587832 1660.152124 3006.112155 3049.846185 3088.759870 3111.896424 3124.612708 3133.633711 3164.372721 3228.273990 3287.042719 3378.080001 3379.790564 3454.813478 3638.455961 3650.125113 3664.428363 3693.771377 cm-1
dipole: 0.000000 0.000000 283.265081 625.682469 185.498600 374.018175 114.439196 507.905365 440.656542 241.514995 638.171697 932.724781 1.329116 353.858122 201.502565 532.363702 58.503379 759.034223 355.452872 1276.463895 1655.905398 484.717677 1465.552873 639.019257 482.487241 13.872768 530.548865 603.271700 1301.323377 1018.310944 1288.325559 370.748239 1314.371418 65.061414 376.175797 223.737624 2230.579022 374.122308 621.189951 86.924444 3140.310291 891.944577 251.830377 1483.511518 2098.581395 1805.526576 378.545754 42.247672 670.057927 605.443895 776.715041 802.536394 453.120110 2195.328087 423.224771 897.650996 22.167368 301.282579 958.421434 5451.740242 1122.441205 162.614520 2417.654783 725.341583 2159.099288 1773.386710 198.847734 479.530960 703.392079 915.872312 991.961955 24.055042 1244.201455 16.166569 60.134124 1293.587254 298.235804 1751.311530 700.409520 1189.699122 349.821638 4534.550022 826.769333 805.496963 2163.474555 1578.822578 139.573700 78.534891 706.474396 53.591307 1007.904115 211.974601 286.994466 2412.142016 4161.059656 1592.515824 247.637995 8978.601749 714.493512 777.671860 1015.350613 701.537885 23.682402 1253.052270 274.434624 362.627802 1342.623769 349.351517 264.940103 357.479647 1218.139760 3387.800177 10.279627 0.710180 4.391806 3.867932 1637.312048 1131.363558 1830.457581 1597.653373 1646.899419 731.303149 331.199928 199.351717 308.046567 121.206317 1e-40.esu2.cm2
absortion: 0.000000 0.000000 2.088573 5.848889 2.011006 5.908730 1.939876 9.086311 8.103935 4.984025 14.295134 23.265057 0.034149 10.102219 5.992938 17.005530 1.943738 25.745702 12.546280 48.075876 64.668227 19.407053 63.137970 28.766908 22.236311 0.650367 26.039466 30.878352 71.441201 57.162028 76.032718 23.336391 84.503145 4.352297 25.311269 15.693686 157.082208 26.878425 46.372674 7.369274 268.170945 78.399892 23.054203 137.213804 195.807941 177.373643 38.392434 4.328505 73.558702 68.235168 88.265332 93.662042 53.224864 272.670675 54.216030 117.479583 2.943549 40.697961 141.469037 813.140655 170.148044 25.114601 374.874077 113.567079 341.705748 291.008351 34.233963 83.037734 122.897187 164.908500 181.669267 4.458671 233.953217 3.105805 11.827160 256.868310 61.006751 360.905961 145.399457 247.659845 74.467076 969.087233 182.595437 178.677037 489.300079 365.608063 32.881734 18.531915 166.885272 12.977157 250.989759 57.912142 79.182266 666.693381 1191.625110 497.849371 77.557448 2813.733599 229.903357 250.980701 338.781548 239.306942 8.666441 467.321052 103.285920 141.795894 530.954031 138.983844 108.484642 148.756954 917.868295 2589.845124 7.958653 0.553952 3.439675 3.038122 1298.665071 915.483756 1508.144961 1352.790551 1395.195079 633.286338 302.054581 182.392007 282.944124 112.220794 km.mole-1
press: 1.000000 atm
temp: 298.150000 k
temp: 298.15 cal.mol-1.K-1
transl: 45.875 cal.mol-1.K-1
rotat: 36.756 cal.mol-1.K-1
vibrat: 130.611 cal.mol-1.K-1
total: 213.242 cal.mol-1.K-1
transl: 0.889 kcal.mol-1
rotat: 0.889 kcal.mol-1
vibrat: 190.035 kcal.mol-1
total: 191.812 kcal.mol-1
transl: 2.981 cal.mol-1.K-1
rotat: 2.981 cal.mol-1.K-1
vibrat: 121.792 cal.mol-1.K-1
total: 127.753 cal.mol-1.K-1
formula: C6H16NO18PW2
InChI: InChI=1S/C6H4NO3.HO4P.7H2O.4O.2W/c8-6-3-1-5(2-4-6)7(9)10;1-5(2,3)4;;;;;;;;;;;;;/h1-4H;1H;7*1H2;;;;;;/q;-2;;;;;;;;;;;;+2;+3/p-3
44 atoms
W  -2.029521 -0.742546 -4.411627
O  -2.813396 0.017039 -2.975152
O  -2.030055 -1.759835 -6.605511
O  -5.43464 0.295277 -2.143149
O  -0.930575 0.46567 -5.068698
O  -0.669509 -1.967511 -3.756513
O  -3.740601 -0.047525 -5.344022
W  -4.947628 0.51758 -3.99248
O  -4.617495 2.238595 -3.9511
O  -6.634398 0.636562 -4.899911
H  -1.943352 -1.0577 -7.282929
H  0.248462 -1.665572 -3.919577
H  -6.915106 1.552805 -5.10514
H  -5.102699 -0.524613 -1.696448
O  -4.517937 -4.297435 -1.208174
C  -3.937183 -3.200692 -0.883561
C  -4.648365 -2.151484 -0.183687
H  -5.702963 -2.315779 0.045162
C  -4.010963 -1.003687 0.239131
H  -4.553275 -0.232414 0.783713
C  -2.640924 -0.810076 -0.04833
N  -2.008502 0.394047 0.322148
O  -2.677169 1.299857 0.911277
O  -0.778161 0.561234 0.05805
C  -1.92358 -1.794955 -0.769424
H  -0.883907 -1.60842 -1.029841
C  -2.549119 -2.943467 -1.182623
H  -2.009837 -3.681476 -1.775217
P  -4.663185 -2.825213 -4.617464
O  -5.479531 -1.645013 -4.023322
O  -3.1329 -2.615285 -4.267021
O  -5.177545 -4.209874 -4.28533
O  -1.923299 -5.007521 -4.960942
H  -2.611139 -5.2916 -5.609871
H  -2.229457 -4.095586 -4.705188
O  -4.307682 -5.380234 -6.478986
H  -4.749132 -5.186227 -5.591184
H  -4.843134 -6.076374 -6.903877
O  -3.04089 -6.107339 -2.571496
H  -3.591447 -5.377557 -2.147976
H  -2.713984 -5.707216 -3.416367
O  -4.679069 -2.657223 -6.280822
H  -2.984081 -2.062455 -6.668881
H  -4.646678 -3.586548 -6.651364
energy: -7.216 -7.137 -7.058 -6.929 -6.828 -6.568 -6.515 -6.376 -5.685 -5.194 -3.457 -3.340 -3.134 -3.106 -3.038 -2.429 -2.213 -1.291 -0.912 -0.566 electronvolt
charge: 2.4290 -0.8496 -0.6564 -0.7491 -0.7818 -0.7553 -0.9407 2.4277 -0.7400 -0.7397 0.3563 0.3075 0.3147 0.3225 -0.7446 0.4661 -0.0069 -0.1376 0.1465 -0.1150 0.0179 0.6023 -0.5727 -0.5707 0.1677 -0.1143 0.1032 -0.1404 1.9194 -0.9248 -0.9432 -0.8896 -0.7548 0.3408 0.3835 -0.7163 0.3621 0.3399 -0.8067 0.3499 0.3408 -0.7771 0.4065 0.3228
mdcq: 1.925157 -0.689131 -0.727045 -0.703909 -0.695356 -0.615167 -0.818434 2.086804 -0.662053 -0.707550 0.393036 0.356706 0.410602 0.305325 -0.670535 0.357485 -0.171035 0.105338 -0.085807 0.096099 0.004743 0.575367 -0.547659 -0.539296 -0.125181 0.134963 -0.117852 0.079975 1.645457 -0.874877 -0.637344 -0.833914 -0.700754 0.295466 0.190440 -0.574860 0.270145 0.368920 -0.831556 0.359856 0.330915 -0.761418 0.479294 0.318639
quadrupole: -23.98307303 -87.64553304 -69.72438328 -43.40848309 -54.74495875 67.39155612
eener: -223.3900 electronvolt
kinener: 235.4338 electronvolt
coulombener: -26.8760 electronvolt
xcener: -259.5010 electronvolt
solvener: -7.7924 electronvolt
dispener: -2.4490 electronvolt
total: -284.5746 electronvolt
charge: 0
title: Hydrogen (TZP)
title: Nitrogen (TZP, 1s frozen)
title: Carbon (TZP, 1s frozen)
title: Oxygen (TZP, 1s frozen)
title: Tungsten (TZP, 4f frozen)
title: [M2O8H4]Subs_H2O_TS 2- IRC2 W3
charge: -2
converged: GEOMETRY CONVERGED
