program: ADF
programVersion: 2019
title: Phosphorus (TZP, 2p frozen)
runtype: GEOMETRY OPTIMIZATION
method: DFT
functional: Becke88 Perdew86
basis: TZP
functional: VWN
spinMolecule: Restricted
epsl: 78.39000
zeropoint: 7.375312 electronvolt
frequency: -4.666 16.189 28.509 30.305 37.878 46.160 59.747 64.049 68.033 69.481 85.474 89.606 109.961 115.666 116.906 125.020 129.526 135.681 151.210 161.560 174.562 176.372 183.283 198.681 201.902 213.372 215.137 218.403 227.477 237.966 242.356 247.550 261.184 266.825 275.909 278.010 282.587 293.204 296.555 301.846 323.624 337.222 349.824 355.539 374.971 397.833 406.698 427.027 443.716 453.460 453.936 478.410 497.185 510.667 516.162 525.737 535.861 542.897 566.800 575.480 579.631 586.155 594.138 603.756 617.574 625.212 634.682 643.875 656.394 666.843 671.409 689.774 701.899 740.082 749.033 795.090 806.529 814.070 823.734 843.790 851.087 855.335 872.754 876.785 911.201 938.555 940.773 952.094 953.591 988.719 994.907 1083.072 1096.348 1111.105 1146.384 1187.591 1206.756 1266.641 1269.211 1278.752 1342.409 1391.750 1427.842 1461.954 1569.563 1574.279 1598.654 1635.344 1666.621 1682.767 2815.825 3119.830 3125.532 3137.991 3144.537 3147.139 3217.215 3315.731 3331.653 3381.750 3529.482 3538.584 3642.844 3658.872 3681.389 3699.733
elementType: W O O O O O O W O O H H H H O C C H C H C N O O C H C H P O O O O H H O H H O H H O H H
frequency: -4.665597 16.189008 28.509133 30.304555 37.878491 46.160209 59.747337 64.048895 68.032522 69.480590 85.474296 89.605886 109.961187 115.666369 116.905533 125.019924 129.526358 135.680543 151.209700 161.560462 174.561853 176.372457 183.282872 198.680608 201.902267 213.371921 215.137237 218.402832 227.476950 237.965722 242.356470 247.550075 261.183858 266.825082 275.908529 278.009774 282.587440 293.203553 296.554928 301.845785 323.623995 337.221644 349.823886 355.538672 374.970616 397.832548 406.698089 427.027059 443.716271 453.460052 453.936494 478.409586 497.184560 510.666573 516.162158 525.736635 535.860566 542.896586 566.800238 575.480345 579.631084 586.155484 594.138013 603.756052 617.573697 625.212029 634.681996 643.875108 656.393903 666.842523 671.409144 689.773829 701.898665 740.082374 749.033498 795.090422 806.529315 814.070165 823.733947 843.789785 851.086774 855.334729 872.753638 876.785066 911.200943 938.554722 940.772671 952.094248 953.590712 988.718975 994.907475 1083.072202 1096.347631 1111.104859 1146.384498 1187.591213 1206.756450 1266.640530 1269.210636 1278.752388 1342.409360 1391.750000 1427.842500 1461.953560 1569.563481 1574.278712 1598.654068 1635.344043 1666.621096 1682.766823 2815.824805 3119.830165 3125.531988 3137.990853 3144.536526 3147.139142 3217.215429 3315.730926 3331.653461 3381.749884 3529.481600 3538.583613 3642.844152 3658.872160 3681.389185 3699.733410 cm-1
dipole: 0.000000 0.000000 43.795130 306.222394 641.398409 447.510507 122.750853 382.097929 391.631931 144.866010 310.792803 675.719080 727.953403 83.108962 135.029058 628.839903 341.791062 330.061568 253.586514 336.762544 44.214313 286.903124 449.265166 248.140069 119.986397 422.019701 211.759299 514.914133 267.481030 831.547236 879.976742 1144.290841 682.041944 417.200268 1458.195793 502.988780 350.676220 418.601094 1474.520636 1583.339748 365.508518 715.612268 5161.397813 942.395612 308.663309 3606.553171 71.527164 635.286451 753.326117 343.387214 1398.321979 64.431900 1236.642756 1207.317914 848.128543 605.757391 1033.338718 1267.358510 4353.958631 504.734407 2328.301896 1824.004905 1462.328014 953.506801 1353.605167 55.837642 3054.055109 2152.383296 362.039432 3182.218596 1029.073639 88.939982 1482.711551 154.678430 151.129188 33.416074 474.681693 530.772006 716.904157 950.368312 600.627047 985.785803 2298.428805 786.773210 988.632770 1483.130570 941.220847 694.757276 74.404187 358.623456 24.714251 1418.558765 109.518553 3216.626222 576.882464 1065.572969 2247.726673 2262.594828 605.660315 981.913430 333.036265 249.236307 1296.913422 376.289812 319.181004 384.945464 229.139030 466.906928 473.423501 300.693586 3276.316675 1.860531 1691.112199 25.771793 9.228392 20.311054 2295.357091 1185.895618 600.164703 1885.964168 1108.388942 653.449335 245.717249 217.349455 290.693144 104.653122 1e-40.esu2.cm2
absortion: 0.000000 0.000000 0.312959 2.326071 6.089738 5.177845 1.838320 6.134291 6.678405 2.522947 6.658625 15.176820 20.064164 2.409534 3.956766 19.705951 11.096779 11.225110 9.611339 13.637568 1.934596 12.683646 20.639668 12.357495 6.072273 22.570858 11.419212 28.188447 15.251356 49.599740 53.456914 71.003140 44.651442 27.902897 100.846084 35.050679 24.839179 30.764344 109.605935 119.794616 29.649426 60.488287 452.579484 83.984312 29.010841 359.642262 7.291573 67.999083 83.785034 39.030240 159.103727 7.726430 154.113244 154.538661 109.730134 79.826122 138.794600 172.462496 618.575041 72.806722 338.274320 267.988961 217.776097 144.299014 209.536104 8.750492 485.859970 347.375607 59.566006 531.901684 173.185599 15.377361 260.861002 28.693788 28.374464 6.659629 95.962314 108.304853 148.021954 201.003806 128.131762 211.347315 502.806396 172.910266 225.801713 348.912924 221.949566 165.802515 17.784328 88.877050 6.163228 385.108240 30.096365 895.846735 165.766097 317.196394 679.893984 718.353548 192.681887 314.729700 112.061019 86.946201 464.161761 137.890424 125.572341 151.900394 91.818805 191.389242 197.771978 126.831221 2312.435206 1.454943 1324.873583 20.270963 7.273789 16.022360 1851.008750 985.607080 501.196861 1598.648525 980.575813 579.588090 224.364585 199.335138 268.240649 97.051151 km.mole-1
press: 1.000000 atm
temp: 298.150000 k
temp: 298.15 cal.mol-1.K-1
transl: 45.875 cal.mol-1.K-1
rotat: 37.008 cal.mol-1.K-1
vibrat: 132.046 cal.mol-1.K-1
total: 214.929 cal.mol-1.K-1
transl: 0.889 kcal.mol-1
rotat: 0.889 kcal.mol-1
vibrat: 190.279 kcal.mol-1
total: 192.056 kcal.mol-1
transl: 2.981 cal.mol-1.K-1
rotat: 2.981 cal.mol-1.K-1
vibrat: 122.621 cal.mol-1.K-1
total: 128.583 cal.mol-1.K-1
formula: C6H16NO18PW2
InChI: InChI=1S/C6H4NO6P.8H2O.4O.2W/c8-7(9)5-1-3-6(4-2-5)13-14(10,11)12;;;;;;;;;;;;;;/h1-4H;8*1H2;;;;;;/q;;;;;;;;;;;;;2*+2/p-4
44 atoms
W  -2.175563 -0.843646 -4.991519
O  -2.994256 -0.106901 -3.442441
O  -2.266657 -1.792572 -6.746041
O  -5.182464 0.646814 -2.115904
O  -1.146886 0.467957 -5.513964
O  -0.832877 -1.977041 -4.154281
O  -4.071303 -0.161777 -5.608821
W  -4.906733 0.568081 -4.05488
O  -4.637711 2.283026 -4.280917
O  -6.762653 0.490901 -4.653374
H  -1.900755 -1.267998 -7.487413
H  0.078143 -1.616213 -4.174422
H  -7.122773 1.358681 -4.931742
H  -4.949929 -0.189394 -1.651863
O  -4.442911 -3.531381 -2.196943
C  -3.825276 -2.641162 -1.339517
C  -4.600515 -2.012243 -0.352387
H  -5.665768 -2.230385 -0.29041
C  -3.996116 -1.127419 0.535629
H  -4.575672 -0.625386 1.306614
C  -2.623652 -0.880297 0.413119
N  -1.988996 0.059907 1.33126
O  -2.695866 0.616853 2.196661
O  -0.764151 0.271312 1.214749
C  -1.844669 -1.509568 -0.564714
H  -0.782045 -1.290874 -0.638982
C  -2.450034 -2.401024 -1.439473
H  -1.877403 -2.882051 -2.228595
P  -4.774045 -3.002362 -3.794354
O  -5.533544 -1.673987 -3.608359
O  -3.382754 -2.819343 -4.465421
O  -5.592973 -4.166971 -4.331156
O  -2.048241 -5.103768 -5.028194
H  -2.814244 -5.481763 -5.538243
H  -2.406757 -4.188409 -4.836879
O  -4.473797 -5.544803 -6.234893
H  -4.943977 -5.062597 -5.468016
H  -5.007629 -6.340316 -6.416987
O  -2.725592 -5.895076 -2.496943
H  -3.348184 -5.162644 -2.293812
H  -2.433964 -5.665189 -3.428219
O  -4.418928 -3.208599 -7.775199
H  -3.718811 -2.693405 -7.295258
H  -4.462415 -4.063239 -7.275887
energy: -7.096 -7.066 -7.051 -6.949 -6.905 -6.824 -6.763 -6.721 -6.581 -6.503 -3.777 -3.218 -3.023 -2.977 -2.938 -2.311 -2.068 -1.823 -1.215 -0.436 electronvolt
charge: 2.4852 -0.9367 -0.8141 -0.7832 -0.7634 -0.7649 -0.9372 2.4342 -0.7625 -0.7774 0.3084 0.3108 0.3115 0.3103 -0.7609 0.3923 0.0840 -0.1332 0.1754 -0.1066 0.0151 0.6570 -0.4913 -0.4909 0.2011 -0.1197 0.1898 -0.1002 1.8628 -0.9270 -0.9395 -0.9312 -0.7688 0.3402 0.3930 -0.7152 0.3975 0.3195 -0.7922 0.3445 0.3542 -0.7984 0.3824 0.3453
mdcq: 2.072884 -0.806504 -0.858037 -0.760128 -0.694394 -0.689956 -0.858591 2.099053 -0.677901 -0.752805 0.426137 0.386109 0.387664 0.294781 -0.597000 0.273535 -0.100351 0.116992 -0.046682 0.119465 0.052007 0.663151 -0.498798 -0.472524 -0.049955 0.117688 -0.051585 0.080807 1.630101 -0.873389 -0.677572 -0.850085 -0.695165 0.353043 0.218864 -0.749503 0.277940 0.448592 -0.764432 0.321494 0.295409 -0.878669 0.433322 0.334987
quadrupole: 6.43770814 -79.04905144 -188.69749957 56.58968752 -106.92526710 -63.02739566
eener: -222.7822 electronvolt
kinener: 232.7630 electronvolt
coulombener: -25.8891 electronvolt
xcener: -259.2912 electronvolt
solvener: -7.5532 electronvolt
dispener: -2.3359 electronvolt
total: -285.0886 electronvolt
charge: 0
title: Hydrogen (TZP)
title: Nitrogen (TZP, 1s frozen)
title: Carbon (TZP, 1s frozen)
title: Oxygen (TZP, 1s frozen)
title: Tungsten (TZP, 4f frozen)
title: [M2O8H4]Subs_H2O_TS 2- IRC1 W3
charge: -2
converged: GEOMETRY CONVERGED
