program: ADF
programVersion: 2019
title: Phosphorus (TZP, 2p frozen)
runtype: GEOMETRY OPTIMIZATION
method: DFT
functional: Becke88 Perdew86
basis: TZP
functional: VWN
spinMolecule: Restricted
epsl: 78.39000
zeropoint: 6.028718 electronvolt
frequency: -6.008 12.668 24.576 42.562 61.667 64.657 77.988 80.987 89.646 98.103 105.890 114.633 119.732 122.169 132.146 151.126 153.081 160.165 164.139 182.003 189.493 199.218 202.906 219.842 231.368 254.311 257.469 265.222 268.322 277.353 284.468 289.525 297.419 319.151 335.009 355.558 364.469 366.344 375.665 379.611 398.588 406.994 453.540 462.053 465.122 470.449 478.921 505.584 519.511 528.810 545.174 604.499 611.682 618.707 620.004 626.048 629.841 631.332 667.492 686.743 699.758 735.778 738.599 769.735 784.159 798.222 815.377 818.192 830.287 853.272 856.893 861.260 887.748 908.308 934.354 943.790 945.974 965.233 972.796 1026.046 1087.863 1093.160 1100.176 1143.773 1185.519 1247.472 1250.643 1285.236 1330.187 1360.284 1461.808 1486.224 1500.868 1576.766 1581.390 1676.339 2993.533 3093.315 3111.387 3123.086 3126.771 3186.773 3411.608 3479.369 3640.573 3644.193 3648.698 3655.244
elementType: W O O O O O O W O O H H H H O C C H C H C N O O C H C H P O O O O H H O H H
frequency: -6.008037 12.668068 24.575928 42.561695 61.666595 64.657434 77.987727 80.986817 89.645990 98.103151 105.890308 114.632727 119.732377 122.168911 132.145633 151.125994 153.081201 160.165376 164.139077 182.003162 189.493036 199.218296 202.906448 219.841648 231.368316 254.310797 257.468821 265.222403 268.322226 277.353110 284.468486 289.524897 297.418866 319.151090 335.009438 355.557648 364.469352 366.343999 375.664660 379.610643 398.587739 406.993829 453.539578 462.052767 465.122403 470.449251 478.920599 505.583896 519.510709 528.809800 545.173953 604.498500 611.682281 618.706638 620.004245 626.047510 629.840812 631.331935 667.492115 686.743466 699.757617 735.777861 738.598744 769.735214 784.158750 798.221684 815.377241 818.192350 830.286579 853.272176 856.893491 861.259665 887.747811 908.308403 934.354470 943.789747 945.974454 965.233461 972.795716 1026.045697 1087.863028 1093.159948 1100.176247 1143.772529 1185.518920 1247.471945 1250.642518 1285.235767 1330.186845 1360.283736 1461.807940 1486.224450 1500.868393 1576.765573 1581.389677 1676.338794 2993.532590 3093.314607 3111.386892 3123.085641 3126.770934 3186.772598 3411.608368 3479.369232 3640.572965 3644.193416 3648.697614 3655.244244 cm-1
dipole: 0.000000 0.000000 341.405785 80.554495 243.352927 239.227901 324.580132 99.037128 1295.028420 760.640818 584.930173 53.435357 68.485382 390.207608 78.366642 1187.462903 546.534693 1702.690387 1947.927664 1446.342426 1044.166963 401.839818 462.961836 193.665797 200.748551 447.626292 782.953286 336.164946 160.735896 401.516652 479.786252 1268.596013 241.512691 1450.105490 575.169045 1335.794605 272.158884 593.646552 2122.696596 683.874472 954.259762 24.115714 347.401618 574.640517 673.001549 2211.331315 604.553905 2267.301720 127.521051 3.568348 1342.055768 5842.035579 761.638494 632.125167 1918.251526 2179.065925 628.534930 1185.443480 1055.292860 99.582719 1892.502362 704.037864 27.931409 8.169842 29.117212 1508.055285 630.914999 1350.907420 611.031158 4407.346021 203.049370 1418.277548 3578.528544 724.944717 556.637866 4.231863 5.836178 34.392873 570.296539 385.722836 959.580737 835.689433 569.563336 4141.508515 2352.995867 5819.617485 4723.424320 795.304967 1012.409825 648.641193 19.312826 1222.475003 246.514840 1473.616938 276.745565 554.702549 3414.303018 7.040054 1.108259 4.504435 2.223241 1047.765066 1714.893983 867.516403 192.641962 180.429721 338.313552 267.099556 1e-40.esu2.cm2
absortion: 0.000000 0.000000 2.103095 0.859383 3.761531 3.877112 6.344922 2.010437 29.099681 18.704265 15.525239 1.535378 2.055358 11.949081 2.595746 44.981848 20.970929 68.356905 80.142499 65.982403 49.595386 20.065975 23.546107 10.671881 11.642182 28.533724 50.528751 22.348105 10.810545 27.913524 34.210548 92.063467 18.004727 116.004276 48.298163 119.049556 24.863462 54.512375 199.878617 65.071803 95.338566 2.460175 39.493452 66.552732 78.462365 260.762219 72.573258 287.329767 16.605596 0.472982 183.393412 885.192031 116.775801 98.031563 298.111195 341.944586 99.228925 187.593022 176.561988 17.141806 331.941945 129.843676 5.171059 1.576279 5.723107 301.730251 128.945891 277.050585 127.165541 942.633353 43.612056 306.177594 796.291658 165.050290 130.365443 1.001117 1.383840 8.321065 139.059433 99.201931 261.657874 228.984820 157.066064 1187.343258 699.210150 1819.714675 1480.703901 256.209110 337.556962 221.162811 7.076430 455.409892 92.739287 582.411315 109.697730 233.077326 2561.911498 5.458561 0.864317 3.526162 1.742451 836.937560 1466.474507 756.582487 175.791836 164.811521 309.410707 244.718971 km.mole-1
press: 1.000000 atm
temp: 298.150000 k
temp: 298.15 cal.mol-1.K-1
transl: 45.736 cal.mol-1.K-1
rotat: 36.397 cal.mol-1.K-1
vibrat: 109.806 cal.mol-1.K-1
total: 191.938 cal.mol-1.K-1
transl: 0.889 kcal.mol-1
rotat: 0.889 kcal.mol-1
vibrat: 156.182 kcal.mol-1
total: 157.959 kcal.mol-1
transl: 2.981 cal.mol-1.K-1
rotat: 2.981 cal.mol-1.K-1
vibrat: 105.587 cal.mol-1.K-1
total: 111.549 cal.mol-1.K-1
formula: C6H12NO16PW2
InChI: InChI=1S/C6H4NO3.HO4P.5H2O.4O.2W/c8-6-3-1-5(2-4-6)7(9)10;1-5(2,3)4;;;;;;;;;;;/h1-4H;1H;5*1H2;;;;;;/q;-2;;;;;;;;;;+2;+3/p-3
38 atoms
W  -2.112349 -1.218589 -4.709246
O  -2.701551 -0.410903 -3.198227
O  -2.29096 -2.016617 -6.86947
O  -5.165283 0.319894 -2.232486
O  -0.813832 -0.190706 -5.32941
O  -0.924684 -2.670086 -4.144061
O  -3.671809 -0.147776 -5.53119
W  -4.700518 0.534376 -4.091047
O  -4.07998 2.172264 -3.999347
O  -6.389818 0.969791 -4.897778
H  -2.097226 -1.30676 -7.516679
H  0.026251 -2.469751 -4.257085
H  -6.543774 1.927343 -5.040421
H  -4.937837 -0.553905 -1.826357
O  -3.799943 -4.316045 -1.653783
C  -3.522232 -3.193973 -1.096442
C  -4.552455 -2.396522 -0.466421
H  -5.576393 -2.772341 -0.499532
C  -4.256956 -1.226696 0.19859
H  -5.038413 -0.649954 0.69096
C  -2.925734 -0.748343 0.231133
N  -2.634604 0.473335 0.873711
O  -3.568302 1.125649 1.435178
O  -1.44101 0.908351 0.879762
C  -1.894996 -1.485128 -0.399491
H  -0.878377 -1.095927 -0.375594
C  -2.179623 -2.66772 -1.036216
H  -1.387207 -3.229597 -1.529255
P  -5.003268 -2.798803 -4.890621
O  -5.57851 -1.532378 -4.182713
O  -3.444438 -2.845325 -4.63581
O  -5.728499 -4.090316 -4.628848
O  -5.063329 -2.473213 -6.541312
H  -5.400226 -3.279416 -6.98336
H  -3.272096 -2.20024 -6.963192
O  -1.835247 -5.216209 -3.244204
H  -2.595562 -4.888753 -2.664341
H  -1.533808 -4.374406 -3.658861
energy: -7.238 -7.173 -6.885 -6.797 -6.619 -6.580 -6.535 -6.401 -5.681 -5.219 -3.392 -3.290 -3.141 -3.045 -3.016 -2.279 -2.199 -1.301 -0.787 -0.498 electronvolt
charge: 2.4554 -0.8599 -0.6460 -0.7517 -0.7941 -0.7925 -0.9386 2.4296 -0.7442 -0.7427 0.3588 0.3094 0.3128 0.3246 -0.7416 0.4840 0.0130 -0.1377 0.1307 -0.1108 0.0137 0.5985 -0.5685 -0.5688 0.1821 -0.1269 0.0678 -0.1268 1.8401 -0.9260 -0.8967 -0.9247 -0.7593 0.3421 0.3971 -0.8161 0.3528 0.3609
mdcq: 2.000222 -0.690011 -0.743513 -0.688590 -0.730043 -0.892829 -0.827597 2.082620 -0.666771 -0.734447 0.433240 0.514597 0.424554 0.289224 -0.641877 0.343258 -0.150933 0.102224 -0.107914 0.127373 0.014818 0.604311 -0.563224 -0.550167 -0.164467 0.155103 -0.127330 0.121356 1.689937 -0.884922 -0.786826 -0.924532 -0.742132 0.381130 0.477578 -0.841875 0.337197 0.361259
quadrupole: -40.25326654 -93.84520484 -92.63541708 -18.36164239 -77.00495613 58.61490893
eener: -207.6392 electronvolt
kinener: 210.6192 electronvolt
coulombener: -14.2414 electronvolt
xcener: -234.0632 electronvolt
solvener: -7.9438 electronvolt
dispener: -1.9680 electronvolt
total: -255.2364 electronvolt
charge: 0
title: Hydrogen (TZP)
title: Nitrogen (TZP, 1s frozen)
title: Carbon (TZP, 1s frozen)
title: Oxygen (TZP, 1s frozen)
title: Tungsten (TZP, 4f frozen)
title: [M2O8H4]Subs_H2O_TS 2- IRC2
charge: -2
converged: GEOMETRY CONVERGED
