program: ADF
programVersion: 2019
title: Phosphorus (TZP, 2p frozen)
runtype: TRANSITION STATE
method: DFT
functional: Becke88 Perdew86
basis: TZP
functional: VWN
spinMolecule: Restricted
epsl: 78.39000
zeropoint: 5.315682 electronvolt
frequency: -154.475 -15.669 20.431 35.569 56.693 67.164 79.829 83.566 97.223 100.891 112.275 118.861 125.757 137.534 153.383 165.378 171.011 182.621 195.150 215.446 217.866 223.844 232.998 240.433 241.294 258.671 268.830 270.174 275.600 288.037 310.587 319.056 343.610 358.403 363.849 367.330 399.357 403.505 413.684 423.892 439.225 443.130 467.917 477.489 495.958 518.389 526.212 537.932 564.879 593.921 603.674 613.853 623.527 640.395 676.109 687.429 689.071 725.841 738.549 769.391 780.420 784.797 796.197 818.637 819.539 829.809 874.977 910.000 938.262 941.319 943.211 963.525 979.907 1009.544 1084.344 1098.109 1122.633 1137.558 1223.094 1238.565 1243.393 1284.470 1331.239 1360.056 1453.808 1486.504 1497.845 1572.005 1587.564 3019.266 3097.624 3105.912 3123.615 3125.192 3399.956 3642.667 3645.231 3647.577 3656.665
elementType: W O O O O O O W O O H H H H O C C H C H C N O O C H C H P O O O O H H
frequency: -154.474523 -15.668906 20.431360 35.569383 56.693043 67.163838 79.828932 83.565730 97.222762 100.891270 112.274688 118.861190 125.756956 137.533832 153.383215 165.378060 171.010821 182.621243 195.150257 215.445617 217.866257 223.844033 232.998160 240.433051 241.294126 258.671490 268.830060 270.174234 275.600439 288.037446 310.586578 319.056332 343.609961 358.402817 363.849284 367.330321 399.356788 403.505420 413.684139 423.892396 439.225085 443.130291 467.917003 477.488683 495.958092 518.389084 526.211694 537.931655 564.879299 593.921059 603.673583 613.853176 623.526561 640.395429 676.108719 687.429195 689.071029 725.840842 738.548801 769.391323 780.420412 784.796917 796.196744 818.637267 819.539060 829.808507 874.976518 910.000434 938.261555 941.318533 943.210588 963.525250 979.907295 1009.544288 1084.344280 1098.109445 1122.633147 1137.557628 1223.093642 1238.564781 1243.393392 1284.470041 1331.238942 1360.055936 1453.807960 1486.503849 1497.845033 1572.004633 1587.563546 3019.266083 3097.624096 3105.912396 3123.614926 3125.191864 3399.956303 3642.667459 3645.230570 3647.576931 3656.664998 cm-1
dipole: 15718.646196 0.000000 677.546964 183.050254 248.625943 211.563811 148.232475 157.526468 316.297735 381.825958 1152.685728 495.485675 185.302761 529.466701 431.148452 1027.909592 2501.102944 506.062043 388.687177 896.516370 495.078027 141.396372 810.628287 66.022936 422.743389 883.011679 80.597204 319.199251 1168.888469 454.066006 1054.638317 329.571711 2628.985465 144.248177 639.632583 3208.822670 3104.820850 17.110626 2312.098376 3196.517801 173.406513 2688.129939 335.227790 1014.001743 45.660762 1789.142091 38.932266 2825.815706 3610.699422 3340.208210 2472.762160 16.618582 676.630013 3335.823168 1096.356297 232.715617 461.029272 1722.261044 42.050532 3.617531 733.180452 15.987036 638.179941 50.000147 500.854288 503.672828 2743.231209 1002.867282 283.774483 1090.953243 34.166944 28.735625 530.771609 803.402513 187.466558 717.165663 1719.654233 4009.119465 3483.068688 3246.339952 7060.607991 620.944515 1198.762230 652.046282 27.388469 1238.638300 244.693825 1541.311446 351.330811 1694.514203 8.581779 3.476692 4.463029 7.679638 2318.207901 157.271918 224.488276 239.575987 241.457373 1e-40.esu2.cm2
absortion: -608.625398 0.000000 3.469882 1.632017 3.533087 3.561680 2.966072 3.299589 7.708007 9.655997 32.439253 14.762137 5.841064 18.252664 16.576114 42.609936 107.209490 23.165044 19.012858 48.414333 27.035954 7.933446 47.342623 3.978937 25.568288 57.252319 5.430951 21.616425 80.747865 32.782797 82.103997 26.356963 226.428975 12.958652 58.335130 295.447668 310.796191 1.730587 239.747037 339.633737 19.091085 298.579348 39.317592 121.361198 5.676311 232.476335 5.135092 381.021082 511.240283 497.256346 374.164506 2.557034 105.750952 535.462812 185.800262 40.098818 79.628872 313.341884 7.784465 0.697650 143.422592 3.144875 127.362512 10.259847 102.886673 104.762167 601.640247 228.751069 66.738330 257.407275 8.077796 6.940038 130.367923 203.299650 50.952919 197.398199 483.901607 1143.142772 1067.824345 1007.838148 2200.537253 199.919356 400.006579 222.286590 9.980513 461.517967 91.868783 607.326590 139.805876 1282.403433 6.663220 2.706659 3.494341 6.015829 1975.621698 143.598128 205.114678 219.041203 221.311365 km.mole-1
press: 1.000000 atm
temp: 298.150000 k
temp: 298.15 cal.mol-1.K-1
transl: 45.663 cal.mol-1.K-1
rotat: 36.513 cal.mol-1.K-1
vibrat: 102.509 cal.mol-1.K-1
total: 184.685 cal.mol-1.K-1
transl: 0.889 kcal.mol-1
rotat: 0.889 kcal.mol-1
vibrat: 138.559 kcal.mol-1
total: 140.337 kcal.mol-1
transl: 2.981 cal.mol-1.K-1
rotat: 2.981 cal.mol-1.K-1
vibrat: 98.487 cal.mol-1.K-1
total: 104.448 cal.mol-1.K-1
formula: C6H10NO15PW2
InChI: InChI=1S/C6H4NO3.O3P.5H2O.4O.2W/c8-6-3-1-5(2-4-6)7(9)10;1-4(2)3;;;;;;;;;;;/h1-4H;;5*1H2;;;;;;/q;-1;;;;;;;;;;+2;+3/p-4
35 atoms
W  -2.012974 -1.564671 -5.725359
O  -2.219556 -0.66978 -4.064606
O  -2.848735 -2.390623 -7.374216
O  -3.984319 0.485169 -2.36055
O  -0.834636 -0.579699 -6.574262
O  -0.768437 -2.985558 -5.223933
O  -3.677797 -0.344395 -5.990151
W  -3.935398 0.503114 -4.30112
O  -3.205004 2.07547 -4.52088
O  -5.800467 0.985683 -4.620327
H  -2.71195 -1.82784 -8.163201
H  0.143631 -2.807008 -5.531696
H  -5.936418 1.942336 -4.778911
H  -4.1624 -0.389835 -1.93451
O  -3.626904 -3.548517 -2.232182
C  -3.580374 -2.689529 -1.283645
C  -4.771982 -2.055377 -0.761849
H  -5.725158 -2.317195 -1.220519
C  -4.719517 -1.176093 0.299268
H  -5.627399 -0.723367 0.694296
C  -3.474089 -0.838549 0.875686
N  -3.41984 0.076243 1.953334
O  -4.492521 0.591041 2.392781
O  -2.297487 0.368655 2.466036
C  -2.279457 -1.407638 0.369414
H  -1.328436 -1.121933 0.816241
C  -2.329729 -2.30027 -0.67435
H  -1.415727 -2.740022 -1.075289
P  -4.77609 -2.949759 -4.416464
O  -5.129689 -1.57051 -3.874519
O  -3.339906 -3.156647 -4.928415
O  -5.689507 -4.122957 -4.241682
O  -5.431785 -2.571338 -6.448799
H  -5.761523 -3.45454 -6.714417
H  -4.545178 -2.477049 -6.925068
energy: -7.285 -7.276 -7.166 -7.137 -6.979 -6.710 -6.633 -6.457 -5.572 -5.256 -3.282 -3.164 -3.071 -3.013 -2.980 -2.238 -2.015 -1.366 -0.639 -0.343 electronvolt
charge: 2.4486 -0.9299 -0.8220 -0.7707 -0.7624 -0.7751 -0.9440 2.4468 -0.7578 -0.7766 0.3213 0.3095 0.3109 0.3052 -0.7370 0.4709 0.0163 -0.1314 0.1752 -0.1132 -0.0096 0.6058 -0.5632 -0.5620 0.1602 -0.1130 0.0653 -0.1470 1.8288 -0.8772 -0.8805 -0.8905 -0.6603 0.3546 0.4042
mdcq: 2.138830 -0.795981 -0.881973 -0.706043 -0.717620 -0.768162 -0.861040 2.074296 -0.668959 -0.769228 0.418550 0.417531 0.409121 0.236278 -0.702724 0.355329 -0.131770 0.092694 -0.064138 0.127142 0.000630 0.681975 -0.585949 -0.589852 -0.147989 0.167795 -0.122915 0.078687 1.693938 -0.830066 -0.824184 -0.860558 -0.705888 0.388155 0.454088
quadrupole: -33.79402844 -68.90949242 -87.77795355 49.34224191 -57.40532029 -15.54821347
eener: -197.7585 electronvolt
kinener: 197.7299 electronvolt
coulombener: -10.6263 electronvolt
xcener: -220.0475 electronvolt
solvener: -7.6598 electronvolt
dispener: -1.7027 electronvolt
total: -240.0650 electronvolt
charge: 0
title: Hydrogen (TZP)
title: Nitrogen (TZP, 1s frozen)
title: Carbon (TZP, 1s frozen)
title: Oxygen (TZP, 1s frozen)
title: Tungsten (TZP, 4f frozen)
title: [M2O8H4]Subs_H2O_TS 2- TS1
charge: -2
converged: GEOMETRY CONVERGED
