program: ADF
programVersion: 2018
title: Hydrogen (TZP)
runtype: TRANSITION STATE
method: DFT
functional: Becke88 Perdew86
basis: TZP
functional: VWN
spinMolecule: Restricted
epsl: 78.39000
zeropoint: 7.848422 electronvolt
frequency: -32.954 -12.814 5.396 14.610 28.834 34.283 37.434 37.936 44.956 57.573 64.679 65.441 74.555 76.916 81.016 86.405 91.099 93.223 96.293 103.383 107.222 111.344 113.629 117.924 135.395 141.034 142.818 147.449 162.217 162.389 168.303 169.986 176.635 182.747 185.785 188.278 194.626 201.450 202.098 207.786 210.263 212.089 214.970 226.970 229.962 232.060 237.483 245.930 247.209 256.665 285.110 289.052 295.518 316.215 317.777 322.334 328.439 332.434 335.337 336.561 339.912 341.812 342.967 346.426 348.676 360.098 375.078 384.714 394.047 402.533 405.593 408.065 433.145 446.100 457.922 462.269 469.312 480.132 484.785 490.502 502.076 507.577 509.474 516.125 521.207 527.721 534.152 534.554 553.851 567.002 589.410 601.493 610.726 629.633 633.097 650.551 677.917 682.484 684.559 706.647 721.666 728.561 739.024 746.598 770.969 771.751 773.861 790.918 801.025 825.690 826.385 844.137 844.883 854.212 856.033 859.330 859.862 865.877 867.826 896.548 902.632 915.245 919.015 929.139 933.543 936.148 938.682 942.210 953.665 957.268 981.744 990.560 995.060 1021.004 1055.185 1083.958 1098.685 1102.979 1103.384 1108.614 1147.468 1157.115 1157.556 1188.196 1240.327 1264.693 1271.774 1279.596 1294.280 1321.121 1341.601 1370.754 1393.552 1428.371 1441.678 1466.453 1466.722 1539.657 1574.215 1576.255 1581.530 3111.899 3120.347 3125.837 3125.888 3132.932 3138.806 3138.929 3144.194 3620.578 3627.530
elementType: W W W W W P P O O O O O O O O O O O O O O O O O O O O O O O C H H C C C H C H C N O O C H H C C C H C H C N O O O H H
frequency: -32.954088 -12.813500 5.396463 14.610407 28.833946 34.282576 37.433727 37.936141 44.956071 57.572573 64.679091 65.441295 74.554544 76.915552 81.016207 86.405423 91.099469 93.222586 96.293413 103.382736 107.222218 111.344354 113.628657 117.923794 135.395145 141.034064 142.818162 147.448703 162.216700 162.388519 168.302634 169.986179 176.634881 182.747339 185.785361 188.278095 194.626466 201.450239 202.097536 207.786017 210.263470 212.089025 214.970272 226.970130 229.962001 232.059560 237.482619 245.929923 247.208520 256.665334 285.110474 289.051715 295.518281 316.214651 317.776513 322.334365 328.438928 332.434402 335.337257 336.561023 339.912046 341.811806 342.966504 346.425740 348.676318 360.098388 375.077807 384.714468 394.046674 402.532605 405.593294 408.065318 433.145196 446.100246 457.921899 462.268654 469.311734 480.132208 484.785353 490.501628 502.076303 507.576983 509.474066 516.125457 521.206522 527.720694 534.152233 534.553628 553.850823 567.002052 589.410228 601.492882 610.725981 629.632736 633.096668 650.551247 677.917182 682.483726 684.558576 706.647088 721.666429 728.560542 739.024093 746.597982 770.969089 771.751353 773.860614 790.917654 801.024977 825.690043 826.384554 844.136751 844.882743 854.212066 856.033183 859.329763 859.862182 865.877054 867.825541 896.547731 902.631673 915.244636 919.014538 929.139026 933.542824 936.147505 938.682018 942.210266 953.664681 957.268036 981.744485 990.559560 995.059750 1021.003848 1055.185456 1083.957541 1098.685399 1102.978928 1103.384004 1108.613530 1147.467505 1157.114573 1157.555639 1188.195759 1240.326727 1264.693385 1271.774014 1279.596292 1294.280329 1321.120860 1341.600949 1370.753787 1393.551946 1428.370623 1441.677571 1466.452714 1466.721539 1539.657206 1574.214621 1576.254725 1581.529963 3111.899218 3120.346596 3125.837167 3125.887852 3132.932118 3138.806006 3138.928894 3144.193639 3620.578157 3627.529918 cm-1
dipole: 49.873006 0.000000 0.000000 0.000000 168.860908 142.949041 133.031972 426.836126 216.494264 211.732992 567.603352 153.592136 787.213492 633.764955 455.515653 499.486706 109.389338 60.492805 35.925124 687.136124 21.635528 265.598938 100.637198 141.043184 1041.104792 1099.957132 2130.999515 230.415039 93.738280 212.016811 1133.464682 131.990683 520.963424 77.813350 195.513805 228.904232 187.852942 303.942841 582.435971 2399.235873 63.973967 32.530566 276.144025 682.847707 2817.605847 2032.544918 268.131533 160.518896 1194.655473 1786.061245 506.585481 790.357204 568.702763 395.166826 1598.851953 423.178071 1114.514730 3675.531291 1466.316606 816.667410 242.200062 1648.622629 425.581663 276.828046 2507.704304 343.540143 167.603210 1099.918833 1554.136385 1206.691199 127.770629 417.728404 512.151493 560.616199 425.448373 226.190671 404.969178 477.631219 738.592880 709.972850 423.934999 2206.221463 1646.916594 152.613949 52.380298 4585.892585 832.314858 1152.231616 1601.643683 189.940563 69.029511 416.520281 183.710519 139.063756 197.430280 753.160464 20411.971477 1022.846368 151.085973 23110.193895 1428.221503 909.626641 105.134756 328.654208 225.624153 160.233787 1135.561414 20.703183 341.391088 163.173298 509.898506 1590.358700 669.660489 2028.958838 4338.656752 3145.808405 4181.751445 4451.182833 1360.802295 134.875023 4397.022247 4057.465205 2323.268788 35.822995 1199.110293 173.698065 26.402231 11.546437 18.889030 39.221814 17.490523 1291.241643 23.826166 2719.108882 7439.567842 969.895915 244.149379 102.553381 863.082139 1673.645640 833.934370 1138.904459 1547.989949 1297.668402 7600.877043 2912.718769 35.885646 51.393842 193.433589 717.406720 373.622114 1103.376623 358.981135 1186.843384 93.030775 603.838420 387.781613 171.468047 508.107536 181.079776 1257.160772 1.804735 153.391781 11.626316 1.375768 6.605309 7.583453 8.927235 9.850908 184.531179 138.595189 1e-40.esu2.cm2
absortion: -0.411958 0.000000 0.000000 0.000000 1.220425 1.228380 1.248237 4.058751 2.439567 3.055500 9.202100 2.519411 14.711085 12.218572 9.250246 10.817901 2.497865 1.413523 0.867107 17.806103 0.581474 7.412635 2.866319 4.168997 35.332601 38.884619 76.286003 8.515886 3.811453 8.629859 47.816411 5.623866 23.065442 3.564374 9.104728 10.802684 9.164272 15.347505 29.504433 124.958941 3.371671 1.729370 14.879630 38.848176 162.410607 118.227277 15.960915 9.894996 74.025983 114.905716 36.202952 57.263388 42.125761 31.321355 127.352689 34.190688 91.752627 306.269786 123.250200 68.894906 20.635684 141.249327 36.585811 24.037999 219.167850 31.008213 15.757299 106.066253 153.502292 121.751769 12.989722 42.726937 55.604510 62.686811 48.833331 26.208804 47.638870 57.481966 89.749632 87.289150 53.351553 280.691393 210.315731 19.743656 6.843147 606.605123 111.437348 154.386435 222.349819 26.994819 10.198365 62.797841 28.122796 21.947210 31.330106 122.813780 3468.483753 174.976924 25.924646 4093.400449 258.350996 166.114249 19.475247 61.504102 43.601419 30.996279 220.268016 4.104370 68.545083 33.771022 105.619474 336.500697 141.817291 434.427199 930.944870 677.594999 901.291208 966.072533 296.009419 30.309796 994.826400 930.829346 535.180043 8.342970 280.589520 40.758420 6.212082 2.726929 4.515267 9.411076 4.304070 320.601971 5.942667 695.876303 1967.680471 263.521147 67.236802 28.352755 238.702454 465.073673 239.855863 330.325215 449.146564 386.482468 2363.077034 923.340471 11.439546 16.483982 62.753552 237.566971 125.641757 379.106563 125.392874 424.925108 33.618076 221.955993 142.565011 66.173684 200.492277 71.544198 498.363601 1.407722 119.972856 9.109332 1.077945 5.187071 5.966361 7.023871 7.763608 167.465656 126.019348 km.mole-1
oldfreq: -32.954 -12.814 cm-1
newfreq: 33.413 18.672 cm-1
dipolederivX: -0.013 0.008 hartree
dipolederivY: -0.012 0.003 hartree
dipolederivZ: -0.010 -0.006 hartree
irintensity: 0.391 0.112 km.mol-1
redmass: 15.758564 50.802959 hartree
press: 1.000000 atm
temp: 298.150000 k
moi: 50965.8081 58885.4705 68254.8148
symmnumber: 1
pointgroup: NOSYM
temp: 298.15 cal.mol-1.K-1
transl: 48.004 cal.mol-1.K-1
rotat: 40.545 cal.mol-1.K-1
vibrat: 194.764 cal.mol-1.K-1
total: 283.313 cal.mol-1.K-1
transl: 0.889 kcal.mol-1
rotat: 0.889 kcal.mol-1
vibrat: 210.740 kcal.mol-1
total: 212.518 kcal.mol-1
transl: 2.981 cal.mol-1.K-1
rotat: 2.981 cal.mol-1.K-1
vibrat: 179.141 cal.mol-1.K-1
total: 185.103 cal.mol-1.K-1
formula: C12H10N2O28P2W5
InChI: InChI=1S/C6H6NO7P.C6H4NO6P.15O.5W/c8-7(9)5-1-3-6(4-2-5)14-15(10,11,12)13;8-7(9)5-1-3-6(4-2-5)13-14(10,11)12;;;;;;;;;;;;;;;;;;;;/h1-4,10-11H;1-4H;;;;;;;;;;;;;;;;;;;;/q;-1;;;;;;;;;;;;;;;;;;;;+1
59 atoms
W  -3.173265 2.186141 1.696579
W  -3.214421 -0.934231 3.370401
W  -0.268268 -2.646769 2.627083
W  1.918087 -0.407863 0.955622
W  0.356409 2.631138 0.507006
P  -1.554818 -0.357182 0.232316
P  -0.201575 0.822867 3.81582
O  -4.424343 2.812172 0.618325
O  -4.003508 0.577612 2.376548
O  -1.704348 0.847788 3.358462
O  -1.534014 2.847973 0.891879
O  -2.706374 0.604961 -0.012065
O  -3.294403 3.278641 3.08567
O  -4.347355 -2.142395 2.744664
O  -1.721988 -2.124235 3.789478
O  -1.815143 -1.310678 1.428119
O  -3.818958 -0.625955 4.999504
O  -0.918091 -4.112985 1.87572
O  0.876027 -3.277859 3.810037
O  0.657728 -0.290148 3.137333
O  0.911779 -2.059413 1.20247
O  -0.17407 0.361214 0.363004
O  1.955689 1.548142 0.864973
O  0.999154 4.210218 0.987701
O  0.355921 2.714708 -1.263367
O  0.228484 2.175698 2.777289
O  -1.323132 -1.273326 -1.114934
O  -0.727607 -0.229714 5.301064
O  3.346562 -0.67013 1.964019
O  2.484767 -0.76945 -0.678805
C  -2.845714 -1.954678 -2.817842
H  -2.53522 -1.086169 -3.396317
H  -4.204704 -2.723863 -4.310797
C  -3.768493 -2.861682 -3.324359
C  -2.302657 -2.16547 -1.544866
C  -2.667043 -3.269621 -0.763322
H  -2.218174 -3.417558 0.217454
C  -3.587935 -4.178128 -1.269736
H  -3.884717 -5.049608 -0.690838
C  -4.128873 -3.965981 -2.543076
N  -5.086521 -4.929891 -3.075538
O  -5.597243 -4.708549 -4.193466
O  -5.356794 -5.940372 -2.393478
C  -0.669638 -2.087562 6.716378
H  -1.758758 -2.065282 6.694762
H  -0.507066 -3.791557 8.021252
C  0.019969 -3.039468 7.437631
C  0.023332 -1.119614 5.944104
C  1.441904 -1.141251 5.919639
H  1.980732 -0.428994 5.299422
C  2.133289 -2.08769 6.650751
H  3.221078 -2.111486 6.638381
C  1.42856 -3.039638 7.408793
N  2.151208 -4.024705 8.157722
O  1.509845 -4.879543 8.824781
O  3.41072 -4.014113 8.131392
O  0.435044 1.810201 4.99716
H  1.067989 2.539638 3.124645
H  0.269145 1.37981 5.860244
energy: -6.702 -6.682 -6.666 -6.636 -6.596 -6.556 -6.524 -6.507 -6.463 -5.612 -3.722 -3.373 -2.740 -2.612 -2.549 -2.389 -2.322 -2.235 -2.196 -1.963 electronvolt
charge: 2.3206 2.3889 2.3685 2.3692 2.3903 2.0391 2.0547 -0.8194 -1.0039 -0.9514 -0.9994 -0.8978 -0.8252 -0.8197 -0.9886 -0.9704 -0.8152 -0.8353 -0.8032 -0.9223 -1.0215 -1.0033 -0.9989 -0.8270 -0.8274 -0.8042 -0.7135 -0.7059 -0.8216 -0.8160 0.1515 -0.1558 -0.1160 0.1797 0.3554 0.1605 -0.0634 0.1985 -0.1399 0.0173 0.6538 -0.4929 -0.4923 0.1270 -0.1465 -0.1180 0.1622 0.4361 0.1435 -0.1423 0.1724 -0.1207 -0.0067 0.6247 -0.5321 -0.5322 -0.7078 0.3362 0.3078
mdcq: 1.999529 1.969047 1.931525 1.972380 1.980720 1.648327 1.673858 -0.721388 -0.821105 -0.820732 -0.823793 -0.870406 -0.758033 -0.757793 -0.730562 -0.778636 -0.716290 -0.723752 -0.690236 -0.795390 -0.816758 -0.822644 -0.820437 -0.727920 -0.755778 -0.792945 -0.468340 -0.633112 -0.739673 -0.734390 0.226312 -0.073075 0.429452 -0.265393 0.056560 0.028864 0.094317 0.264161 -0.172439 -0.488660 1.458986 -0.939747 -0.515169 -0.171476 0.160545 0.113047 -0.130698 0.274479 -0.133951 0.058629 -0.124848 0.147507 0.185467 0.500426 -0.497184 -0.481085 -0.736318 0.403692 0.472323
quadrupole: 15.23899342 10.31977718 2.38581659 11.58804474 82.88178828 -26.82703816
eener: -393.6599 electronvolt
kinener: 369.8932 electronvolt
coulombener: 13.2482 electronvolt
xcener: -409.0604 electronvolt
solvener: -20.7276 electronvolt
dispener: -4.3765 electronvolt
total: -444.6830 electronvolt
charge: 0
title: Phosphorus (TZP, 2p frozen)
title: Nitrogen (TZP, 1s frozen)
title: Carbon (TZP, 1s frozen)
title: Oxygen (TZP, 1s frozen)
title: Tungsten (TZP, 4f frozen)
title: [W5P2O23]2subsH2O-4- Opt
charge: -4
converged: GEOMETRY CONVERGED
