program: ADF
programVersion: 2018
title: Phosphorus (TZP, 2p frozen)
runtype: GEOMETRY OPTIMIZATION
method: DFT
functional: Becke88 Perdew86
basis: TZP
functional: VWN
spinMolecule: Restricted
epsl: 78.39000
zeropoint: 8.037015 electronvolt
frequency: 2.852 18.133 33.024 36.465 39.448 59.241 62.097 68.638 77.091 83.855 85.836 100.640 107.491 114.771 120.194 127.895 131.894 140.796 147.354 156.168 163.330 172.232 174.153 179.190 181.060 198.672 204.994 210.357 214.927 225.455 229.166 236.203 239.917 246.753 258.840 264.406 270.749 273.589 280.871 293.056 302.139 309.608 330.014 336.843 354.707 365.778 370.511 383.858 399.064 409.827 416.876 429.394 446.327 460.816 481.939 483.962 489.264 507.407 525.464 527.915 534.012 565.548 568.115 581.367 607.854 611.395 618.132 622.003 624.687 663.233 681.059 682.671 697.988 715.274 731.560 740.242 748.247 754.743 776.858 783.021 793.763 809.937 816.539 827.929 841.741 847.881 874.007 882.730 904.249 930.469 934.584 939.395 945.846 972.908 985.308 988.895 1072.864 1091.638 1103.579 1121.193 1135.764 1160.809 1204.416 1241.465 1262.145 1297.363 1320.648 1384.607 1426.853 1464.306 1516.611 1570.327 1595.743 1622.052 1646.727 1659.074 1676.621 2478.810 2857.146 3112.107 3117.323 3133.603 3137.246 3146.140 3157.089 3192.899 3288.654 3382.314 3413.205 3452.876 3509.194 3567.089 3640.760 3646.871 3669.972
elementType: Mo O O O O O O Mo O O H H H H O C C H C H C N O O C H C H P O O O O H H O H H O H H O H H O H H
frequency: 2.852231 18.132698 33.024067 36.464931 39.448223 59.241358 62.097199 68.637935 77.090969 83.855159 85.835950 100.639936 107.490686 114.771389 120.193568 127.895200 131.893743 140.795613 147.354263 156.168430 163.329675 172.232061 174.153225 179.189975 181.060012 198.672038 204.993520 210.357130 214.927380 225.454531 229.165599 236.203393 239.916950 246.752650 258.839844 264.406059 270.748907 273.588521 280.870937 293.055716 302.139047 309.607582 330.014141 336.842976 354.707079 365.777599 370.510995 383.858092 399.064321 409.827090 416.876190 429.393593 446.326586 460.815511 481.939205 483.962319 489.264477 507.407090 525.463820 527.914665 534.012377 565.548443 568.114964 581.367308 607.853872 611.394950 618.131807 622.002788 624.686571 663.233029 681.059122 682.670612 697.987694 715.273903 731.559575 740.241909 748.247289 754.743464 776.857881 783.020629 793.763123 809.936693 816.538624 827.929059 841.741365 847.881116 874.007071 882.730500 904.248896 930.469304 934.584068 939.394789 945.845936 972.908085 985.308457 988.894810 1072.864396 1091.637827 1103.579319 1121.193239 1135.763749 1160.809233 1204.416478 1241.465324 1262.144559 1297.363024 1320.648151 1384.607295 1426.853022 1464.305942 1516.611024 1570.326802 1595.742663 1622.051942 1646.726921 1659.073906 1676.621250 2478.809839 2857.145758 3112.107009 3117.322757 3133.602792 3137.245800 3146.139575 3157.088915 3192.898609 3288.653797 3382.313628 3413.205129 3452.875860 3509.194430 3567.088929 3640.759703 3646.871184 3669.972198 cm-1
dipole: 0.000000 0.000000 489.141022 92.343643 206.831614 424.848806 33.753424 818.658956 779.128295 918.381033 542.621541 381.317333 3.437924 57.170493 802.929026 70.617250 458.125932 588.953393 637.452504 919.799341 729.287217 158.130515 1438.867957 303.298143 197.378652 343.909036 594.384778 1306.348022 220.182137 405.873116 628.456124 849.548322 1100.195669 1578.474554 96.300597 1971.093567 1603.168016 522.406285 2193.226791 699.908497 1311.007121 831.701861 1610.126328 639.373179 822.674218 153.585823 547.427152 965.092423 1614.585965 27.759412 1267.987022 668.801449 246.506188 1437.505779 307.928388 823.825321 872.753843 865.844254 66.885220 340.827897 1583.873948 2003.714829 2266.390408 678.631741 4375.366643 1685.358258 792.789129 323.201342 213.439548 1080.908872 97.065189 88.837374 2654.785400 2086.196118 2070.954826 43.004781 623.490491 1384.484339 1071.710191 478.538029 40.068792 437.205870 974.044440 361.677863 32.951591 3952.803845 440.868096 1705.131798 453.429272 683.073828 56.439593 1666.099678 166.441223 1879.461308 78.202190 2842.895628 1388.915399 2594.885617 117.271480 958.073225 2222.107170 550.309695 2534.567974 7383.234437 9.258585 70.427674 245.264574 1309.872266 135.889539 848.465291 247.352718 1038.335026 280.144724 188.112428 1062.605572 802.649488 397.423474 7128.801050 2408.285074 1283.429233 6.346693 1.698237 10.955463 13.976164 2641.074472 965.609204 495.586840 1154.199668 1134.032019 774.668867 300.896470 571.524158 309.676859 235.539004 294.472115 1e-40.esu2.cm2
absortion: 0.000000 0.000000 4.048953 0.844035 2.045137 6.308665 0.525373 14.084625 15.055339 19.303264 11.674662 9.619112 0.092629 1.644688 24.190033 2.263826 15.145623 20.784909 23.544453 36.005132 29.856698 6.826652 62.810251 13.622648 8.957788 17.126097 30.541185 68.880168 11.861836 22.936509 36.099606 50.298182 66.162047 97.628694 6.247959 130.634147 108.798729 35.824846 154.407509 51.412596 99.286448 64.544216 133.189679 53.983368 73.143513 14.081415 50.839996 92.857647 161.503577 2.851603 132.495147 71.983148 27.577739 166.040778 37.198040 99.936643 107.031972 110.122074 8.809496 45.100041 212.006906 284.042805 322.737196 98.892384 666.640523 258.280817 122.833506 50.389907 33.420669 179.693885 16.570148 15.201449 464.467421 374.029264 379.750535 7.979368 116.937298 261.918080 208.687774 93.922086 7.972146 88.759558 199.357957 75.057332 6.952374 840.075456 96.583222 377.280324 102.772190 159.311735 13.221487 392.308030 39.460208 458.335263 19.313865 704.675356 373.506958 710.027002 32.439491 269.250949 632.602747 160.120187 765.171352 2297.520115 2.929084 22.902502 81.189529 454.604397 48.600791 311.418190 94.030548 408.700922 112.052971 76.482190 438.603148 333.787244 167.019259 4429.327331 1724.719052 1001.162373 4.959151 1.333891 8.615041 11.021584 2089.996366 772.795517 408.522511 978.527174 970.210067 670.463496 264.668706 511.006706 282.604348 215.308576 270.885039 km.mole-1
press: 1.000000 atm
temp: 298.150000 k
moi: 12987.5931 15975.5971 19040.6175
symmnumber: 1
pointgroup: NOSYM
temp: 298.15 cal.mol-1.K-1
transl: 45.227 cal.mol-1.K-1
rotat: 36.622 cal.mol-1.K-1
vibrat: 135.865 cal.mol-1.K-1
total: 217.715 cal.mol-1.K-1
transl: 0.889 kcal.mol-1
rotat: 0.889 kcal.mol-1
vibrat: 206.474 kcal.mol-1
total: 208.251 kcal.mol-1
transl: 2.981 cal.mol-1.K-1
rotat: 2.981 cal.mol-1.K-1
vibrat: 129.035 cal.mol-1.K-1
total: 134.997 cal.mol-1.K-1
formula: C6H18Mo2NO19P
InChI: InChI=1S/C6H5NO3.2Mo.HO4P.8H2O.4O/c8-6-3-1-5(2-4-6)7(9)10;;;1-5(2,3)4;;;;;;;;;;;;/h1-4,8H;;;1H;8*1H2;;;;/q;+2;+3;-1;;;;;;;;;;;;/p-4
47 atoms
Mo -1.668275 -1.5083 -4.757359
O  -2.541371 -0.540081 -3.466077
O  -1.710358 -2.356471 -6.604769
O  -4.798228 0.320316 -2.361101
O  -0.540344 -0.327416 -5.362935
O  -0.469378 -2.716326 -3.82521
O  -3.532744 -0.414707 -5.726068
Mo -4.360223 0.374016 -4.273918
O  -3.807123 2.018398 -4.329818
O  -6.1734 0.692472 -4.975027
H  -1.205486 -1.811063 -7.241008
H  0.48198 -2.605567 -4.034242
H  -6.325528 1.630353 -5.212659
H  -4.717128 -0.606924 -2.045765
O  -3.357279 -4.727416 -1.578084
C  -3.258602 -3.495945 -1.061825
C  -4.412594 -2.929274 -0.468612
H  -5.336077 -3.506595 -0.457378
C  -4.365281 -1.65669 0.071225
H  -5.250344 -1.207368 0.516821
C  -3.166864 -0.921811 0.007263
N  -3.140282 0.43259 0.489525
O  -4.169141 0.90399 1.034349
O  -2.091327 1.108532 0.343498
C  -2.012253 -1.474974 -0.566843
H  -1.097908 -0.888577 -0.612294
C  -2.053698 -2.757927 -1.079723
H  -1.161918 -3.189545 -1.528357
P  -4.694112 -3.005781 -4.682236
O  -5.282065 -1.765703 -3.963163
O  -3.131596 -3.049744 -4.512765
O  -5.351853 -4.34234 -4.393888
O  -2.994323 -4.595715 -7.355033
H  -3.097788 -5.597459 -5.913225
H  -2.411667 -3.828009 -7.077865
O  -3.328871 -6.083649 -5.066408
H  -4.093061 -5.522148 -4.737255
H  -2.169647 -5.569046 -4.021116
O  -1.511585 -5.305478 -3.288615
H  -2.556937 -4.933202 -2.208798
H  -1.169196 -4.424166 -3.578918
O  -7.355722 -1.267476 -6.582964
H  -7.018428 -0.541363 -6.000276
H  -6.605351 -1.907405 -6.544844
O  -4.917635 -2.732305 -6.322945
H  -4.380349 -1.909781 -6.497641
H  -3.87348 -4.169491 -7.22657
energy: -7.120 -7.062 -7.000 -6.967 -6.808 -6.790 -6.743 -6.602 -6.400 -5.930 -4.014 -3.938 -3.787 -3.655 -3.504 -3.165 -2.800 -1.760 -1.579 -0.827 electronvolt
charge: 2.4497 -0.8610 -0.8202 -0.7760 -0.7106 -0.8268 -0.9091 2.3973 -0.7071 -0.8371 0.2774 0.3049 0.3045 0.2987 -0.5934 0.4868 0.0982 -0.1456 0.1366 -0.1047 -0.0017 0.6355 -0.5187 -0.5210 0.2233 -0.1270 0.1029 -0.1301 1.8963 -0.9273 -0.9099 -0.9365 -0.7777 0.3651 0.4022 -0.7737 0.3578 0.3726 -0.7414 0.3250 0.3817 -0.7924 0.3780 0.3487 -0.8010 0.3577 0.3491
mdcq: 2.130099 -0.763764 -0.978948 -0.743892 -0.689829 -0.883818 -0.851527 2.148420 -0.655995 -0.786148 0.476798 0.497109 0.397260 0.317989 -0.512746 0.317981 -0.136619 0.122283 -0.122335 0.136756 0.007180 0.655794 -0.511018 -0.504200 -0.101518 0.138326 -0.141654 0.176053 1.615729 -0.907444 -0.749125 -0.862974 -0.745011 0.360595 0.376314 -0.725716 0.313256 0.296492 -0.643012 0.328138 0.308174 -0.821487 0.361411 0.315323 -0.619514 0.345597 0.315216
quadrupole: -34.94625815 -108.43871052 -211.52082942 57.68364080 -131.40898433 -22.73738265
eener: -222.2544 electronvolt
kinener: 155.9746 electronvolt
coulombener: 40.3744 electronvolt
xcener: -260.2603 electronvolt
solvener: -7.0208 electronvolt
dispener: -2.5558 electronvolt
total: -295.7424 electronvolt
charge: 0
title: Hydrogen (TZP)
title: Molybdenum (TZP, 4p frozen)
title: Nitrogen (TZP, 1s frozen)
title: Carbon (TZP, 1s frozen)
title: Oxygen (TZP, 1s frozen)
title: [M2O8H4]Subs_H2O_TS 2- IRC2 W4
charge: -2
converged: GEOMETRY CONVERGED
