program: ADF
programVersion: 2018
title: Phosphorus (TZP, 2p frozen)
runtype: GEOMETRY OPTIMIZATION
method: DFT
functional: Becke88 Perdew86
basis: TZP
functional: VWN
spinMolecule: Restricted
epsl: 78.39000
zeropoint: 8.057347 electronvolt
frequency: 22.446 26.144 31.533 41.470 47.906 53.376 66.072 71.253 74.953 83.842 91.173 99.705 107.183 111.265 115.562 118.553 129.257 138.433 148.738 151.645 158.516 161.022 166.097 173.970 180.393 192.310 196.647 205.510 208.851 220.776 226.467 228.936 241.702 248.402 259.452 265.297 270.419 283.712 285.282 291.634 306.172 321.311 324.866 361.211 363.794 371.409 383.281 392.905 403.459 405.273 433.812 434.962 442.039 444.322 468.338 474.483 493.567 507.755 513.782 520.483 531.868 535.283 548.185 553.780 572.797 576.968 588.569 602.066 612.962 620.733 626.944 634.860 653.027 663.023 687.953 692.856 740.856 746.340 748.578 767.362 794.170 801.732 808.445 838.708 844.853 850.471 851.794 885.592 889.473 907.718 923.043 936.605 950.318 969.327 994.183 1003.580 1036.961 1083.821 1098.775 1116.063 1125.759 1151.967 1204.790 1254.996 1266.830 1271.085 1338.749 1393.227 1427.101 1462.898 1568.037 1572.105 1590.519 1632.385 1651.082 1660.597 1667.089 2968.425 3065.010 3123.693 3127.566 3144.245 3145.822 3182.441 3275.765 3342.329 3364.117 3410.758 3432.552 3451.600 3481.514 3503.702 3578.791 3636.499 3645.962
elementType: Mo O O O O O O Mo O O H H H H O C C H C H C N O O C H C H P O O O O H H O H H O H H O H H O H H
frequency: 22.446453 26.143696 31.533436 41.470084 47.905937 53.375512 66.071854 71.253298 74.952982 83.842004 91.172760 99.705238 107.182731 111.264856 115.561839 118.552682 129.256502 138.433116 148.738224 151.644946 158.515603 161.022011 166.097177 173.970287 180.392548 192.310072 196.646629 205.509689 208.850582 220.776411 226.467173 228.936271 241.701566 248.402024 259.451548 265.297391 270.419179 283.711812 285.281742 291.633849 306.171708 321.311374 324.865679 361.210504 363.793866 371.408529 383.281025 392.905053 403.459073 405.272962 433.811855 434.961730 442.038927 444.321535 468.337703 474.482788 493.566689 507.755423 513.782243 520.482855 531.868129 535.283300 548.184671 553.779979 572.796686 576.967788 588.569190 602.065837 612.961923 620.733404 626.943805 634.859926 653.027496 663.023238 687.953231 692.856343 740.856495 746.339958 748.577764 767.361676 794.170181 801.731659 808.445352 838.707546 844.853201 850.470861 851.794052 885.591641 889.472795 907.717963 923.042701 936.605407 950.318402 969.327030 994.183324 1003.580382 1036.960675 1083.821157 1098.774909 1116.062953 1125.759343 1151.967233 1204.790086 1254.996240 1266.830068 1271.085004 1338.749380 1393.226739 1427.101399 1462.898347 1568.036601 1572.104995 1590.518746 1632.384726 1651.082081 1660.596699 1667.089063 2968.424544 3065.009883 3123.692607 3127.566123 3144.245092 3145.821859 3182.441310 3275.765173 3342.329059 3364.117118 3410.758253 3432.552150 3451.600100 3481.514252 3503.702447 3578.790692 3636.498828 3645.962496 cm-1
dipole: 47.240796 262.141414 1285.107610 144.643501 383.349300 373.734104 333.452822 44.118410 382.046347 91.041081 128.728000 140.625776 709.380852 41.538392 254.979319 718.050710 449.776998 908.004880 123.046456 104.790276 890.263072 332.271855 566.546369 148.728126 166.970329 1061.490741 162.195769 1144.869452 615.415286 627.631290 1715.983192 1251.481962 475.482311 403.656557 36.713017 275.328855 789.330224 25.781281 86.264761 640.053447 259.465321 294.993447 309.119874 5206.457997 276.713910 891.524490 85.694164 2030.227207 1280.026602 21.397323 263.447456 16.793566 769.217407 119.488533 1585.037963 1881.045308 1554.691100 2525.182757 3104.838012 24.207182 861.590240 1145.781865 1390.434580 644.217773 926.224759 557.753541 4886.330560 3145.420380 2045.991273 1689.684330 488.308456 1556.624326 842.447414 1981.377587 226.491260 2555.985894 556.354902 125.379027 12.485540 1012.107158 40.284940 1002.701125 234.696936 254.355905 666.143346 2206.768688 185.111517 2727.253698 608.252679 2186.556985 817.086025 13.377279 13.264261 52.051554 20.395304 1119.948515 631.171232 1267.482517 61.842290 3888.327580 1504.013462 781.106239 2521.709392 1381.805229 2448.922247 265.899424 287.608342 300.459860 1256.232894 463.958656 295.022419 608.302784 532.863585 151.100049 775.109061 327.874337 569.619705 1747.424710 2933.528567 0.126084 9.365634 6.225034 9.612982 1044.022119 1162.189003 1003.982476 836.683097 960.344002 43.886937 2050.160397 567.119616 1161.577777 461.937609 269.296564 215.018324 1e-40.esu2.cm2
absortion: 0.265793 1.717832 10.157547 1.503529 4.603224 5.000148 5.522414 0.787958 7.177663 1.913274 2.941821 3.514479 19.058221 1.158473 7.385799 21.337551 14.572287 31.506942 4.587433 3.983153 35.372719 13.410868 23.587167 6.485542 7.549809 51.167749 7.994735 58.974781 32.216773 34.732443 97.408389 71.815348 28.806593 25.133051 2.387561 18.308922 53.502527 1.833412 6.168584 46.787759 19.912347 23.758364 25.171485 471.390484 25.232741 82.997158 8.232782 199.944899 129.448360 2.173628 28.646627 1.830931 85.229058 13.307659 186.070215 223.716383 192.339297 321.384891 399.849086 3.158121 114.863702 153.731799 191.053729 89.422750 132.982641 80.662555 720.872466 474.679800 314.351360 262.898897 76.736313 247.707866 137.896213 329.286606 39.056060 443.894455 103.315167 23.455228 2.342730 194.672530 8.019261 201.501650 47.559377 53.472495 141.067516 470.429255 39.522655 605.392614 135.610954 497.496237 189.046067 3.140527 3.159587 12.646842 5.082469 281.726884 164.054275 344.332228 17.032263 1087.751293 424.399979 225.542455 761.525572 434.677666 777.627176 84.716901 96.511448 104.926777 449.368952 170.126317 115.954948 239.706285 212.438343 61.825153 320.781673 136.473920 238.024618 1300.177232 2253.721621 0.098721 7.342125 4.906098 7.580020 832.814299 954.261919 841.111184 705.521369 821.023970 37.759870 1773.725392 494.903946 1020.125448 414.378955 245.466559 196.501441 km.mole-1
press: 1.000000 atm
temp: 298.150000 k
moi: 12287.9376 18698.5222 20790.3831
symmnumber: 1
pointgroup: NOSYM
temp: 298.15 cal.mol-1.K-1
transl: 45.227 cal.mol-1.K-1
rotat: 36.811 cal.mol-1.K-1
vibrat: 149.441 cal.mol-1.K-1
total: 231.479 cal.mol-1.K-1
transl: 0.889 kcal.mol-1
rotat: 0.889 kcal.mol-1
vibrat: 208.311 kcal.mol-1
total: 210.089 kcal.mol-1
transl: 2.981 cal.mol-1.K-1
rotat: 2.981 cal.mol-1.K-1
vibrat: 134.343 cal.mol-1.K-1
total: 140.304 cal.mol-1.K-1
formula: C6H18Mo2NO19P
InChI: InChI=1S/C6H4NO6P.2Mo.9H2O.4O/c8-7(9)5-1-3-6(4-2-5)13-14(10,11)12;;;;;;;;;;;;;;;/h1-4H;;;9*1H2;;;;/q;2*+2;;;;;;;;;;;;;/p-4
47 atoms
Mo -1.67853 -1.354155 -5.040348
O  -2.60551 -0.526906 -3.638113
O  -1.633643 -2.016773 -6.892917
O  -4.759025 0.430891 -2.460036
O  -0.393664 -0.205384 -5.226967
O  -0.596552 -2.760651 -4.184931
O  -3.533205 -0.55715 -5.833741
Mo -4.454382 0.234565 -4.378973
O  -4.140956 1.910752 -4.65644
O  -6.283915 0.162315 -5.091793
H  -2.505394 -2.034746 -7.359891
H  0.343434 -2.501614 -4.077969
H  -6.549179 1.022348 -5.482557
H  -4.643973 -0.432078 -1.997784
O  -3.96525 -3.719258 -2.347536
C  -3.635425 -2.755564 -1.424186
C  -4.651308 -2.192864 -0.631983
H  -5.682161 -2.505301 -0.789897
C  -4.328465 -1.255218 0.343359
H  -5.098972 -0.806791 0.965627
C  -2.987759 -0.88816 0.508657
N  -2.644868 0.099904 1.525354
O  -3.568942 0.624178 2.181507
O  -1.441525 0.383462 1.698771
C  -1.969119 -1.441874 -0.275211
H  -0.938633 -1.128162 -0.127032
C  -2.296751 -2.378668 -1.245901
H  -1.527867 -2.805482 -1.887224
P  -4.457043 -3.270345 -3.948566
O  -5.206436 -1.932071 -3.793141
O  -3.129308 -3.147158 -4.726945
O  -5.294152 -4.476683 -4.350943
O  -2.8282 -4.80113 -7.19829
H  -3.079834 -5.388832 -6.416369
H  -2.224139 -4.152657 -6.776262
O  -3.469049 -6.325491 -5.061536
H  -4.204405 -5.687774 -4.793996
H  -2.726807 -6.033253 -4.464557
O  -1.628561 -5.25098 -3.206429
H  -2.426389 -4.867166 -2.772183
H  -1.27429 -4.45767 -3.681873
O  -7.087039 -1.915514 -6.867316
H  -6.829999 -1.247557 -6.186464
H  -6.211384 -2.293011 -7.13915
O  -4.433917 -2.570324 -7.500106
H  -4.252825 -1.996886 -6.712209
H  -4.038854 -3.46022 -7.264688
energy: -7.238 -7.159 -7.070 -7.060 -7.010 -6.905 -6.752 -6.664 -6.408 -6.321 -4.089 -3.981 -3.850 -3.776 -3.750 -3.266 -2.955 -1.868 -1.742 -1.228 electronvolt
charge: 2.4111 -0.8756 -0.7968 -0.7740 -0.7059 -0.8198 -0.9426 2.4325 -0.6857 -0.8269 0.2950 0.2977 0.3046 0.2886 -0.7724 0.4065 0.0943 -0.1388 0.1785 -0.1072 0.0112 0.6574 -0.4918 -0.4913 0.1992 -0.1210 0.1786 -0.1071 1.8615 -0.9322 -0.9145 -0.9348 -0.7662 0.3754 0.3633 -0.7792 0.3553 0.3569 -0.7577 0.3528 0.3904 -0.7871 0.3782 0.3388 -0.7327 0.3920 0.3415
mdcq: 2.125312 -0.812816 -0.749603 -0.738690 -0.672613 -0.886705 -0.851364 2.156588 -0.624114 -0.775218 0.351448 0.484862 0.391705 0.265812 -0.549483 0.262936 -0.104094 0.100960 -0.063688 0.147562 0.117693 0.527529 -0.467290 -0.421116 -0.047168 0.106349 -0.039406 0.056440 1.603670 -0.871384 -0.745622 -0.859567 -0.718874 0.337661 0.290149 -0.708545 0.312297 0.285410 -0.651961 0.271033 0.360529 -0.808222 0.358662 0.324150 -0.669681 0.268395 0.330070
quadrupole: 18.68761221 -125.05350084 -230.21272404 81.80532675 -171.21530477 -100.49293896
eener: -221.1876 electronvolt
kinener: 154.2036 electronvolt
coulombener: 40.6446 electronvolt
xcener: -259.6568 electronvolt
solvener: -6.9437 electronvolt
dispener: -2.5884 electronvolt
total: -295.5283 electronvolt
charge: 0
title: Hydrogen (TZP)
title: Molybdenum (TZP, 4p frozen)
title: Nitrogen (TZP, 1s frozen)
title: Carbon (TZP, 1s frozen)
title: Oxygen (TZP, 1s frozen)
title: [M2O8H4]Subs_H2O_TS 2- IRC1 W4
charge: -2
converged: GEOMETRY CONVERGED
