program: ADF
programVersion: 2019
title: Hydrogen (TZP)
runtype: TRANSITION STATE
method: DFT
functional: Becke88 Perdew86
basis: TZP
functional: VWN
spinMolecule: Restricted
epsl: 78.39000
zeropoint: 6.006404 electronvolt
frequency: -266.865 -17.205 19.215 24.973 32.604 37.970 56.601 60.558 65.386 70.395 80.423 99.210 115.811 159.025 166.126 174.571 191.112 207.171 219.196 235.057 246.530 263.435 276.723 285.646 308.885 315.789 340.009 357.299 373.190 395.218 398.195 409.117 424.752 455.659 464.596 472.669 486.051 514.014 555.800 570.443 593.612 635.097 649.633 682.492 683.609 701.068 721.682 737.929 748.339 775.423 799.550 805.015 814.089 824.616 825.932 846.123 937.199 942.024 978.706 981.471 1090.702 1104.425 1118.314 1132.945 1156.755 1158.106 1235.245 1270.904 1281.960 1322.945 1376.643 1434.648 1463.543 1542.966 1577.353 1603.798 1627.701 1661.922 1674.644 2292.790 3106.127 3128.984 3129.466 3135.472 3145.435 3147.462 3157.655 3191.653 3294.392 3669.629 3674.662 3680.032 3687.526
elementType: P O O O O C C H C H C N O O C H C H O H H O H H O H H O H H O H H
frequency: -266.865482 -17.205081 19.215232 24.972623 32.603828 37.969519 56.601309 60.557912 65.386003 70.394666 80.422862 99.209566 115.810698 159.025196 166.125847 174.570980 191.111556 207.171412 219.196430 235.057478 246.529844 263.435107 276.723167 285.646498 308.884597 315.789369 340.009493 357.298789 373.190336 395.218110 398.194818 409.116640 424.752039 455.659154 464.596356 472.669208 486.051371 514.013892 555.799741 570.443223 593.611654 635.097319 649.633078 682.492175 683.608766 701.067839 721.681812 737.929132 748.339356 775.423056 799.550330 805.015087 814.088917 824.615578 825.932236 846.122677 937.199228 942.024083 978.705652 981.471244 1090.702338 1104.424509 1118.314016 1132.945381 1156.755279 1158.106370 1235.245246 1270.904104 1281.960366 1322.944863 1376.643337 1434.647898 1463.543496 1542.966109 1577.352868 1603.797668 1627.701191 1661.921781 1674.644165 2292.789899 3106.126755 3128.984249 3129.465569 3135.472402 3145.434867 3147.461799 3157.654879 3191.653130 3294.392470 3669.629301 3674.662034 3680.031755 3687.525946 cm-1
dipole: 13721.041815 0.000000 0.000000 80.275591 1145.150945 51.641124 143.482528 32.614917 37.066742 113.489394 151.602251 161.344665 241.323476 76.543034 173.761174 482.685907 856.187220 341.301057 2321.003138 1172.970628 873.975777 1753.646412 699.912220 164.479722 2299.925642 1186.404414 253.171467 404.755393 843.058336 772.348726 5562.874167 319.204312 505.390016 517.003547 1393.620591 901.677252 69.817238 205.148477 1103.195901 288.975876 500.670899 258.032641 1717.475101 45.309454 240.597566 626.430615 575.653411 149.416158 1074.953772 12.070372 1252.119157 265.858117 659.001002 420.542775 179.500083 480.618556 14.605328 2.708215 2302.589147 32.229669 3265.537330 331.366939 3580.634523 2120.283402 2694.937209 443.959463 7594.925883 5.602032 34.204114 537.821163 1269.279400 106.256379 618.215934 179.658510 1278.099972 133.521392 493.981011 772.920615 375.664070 5854.115681 6.806855 1409.717920 3.879584 6.319955 437.457473 124.109099 3470.986562 992.229222 1150.040086 42.839319 70.876647 106.794780 60.479932 1e-40.esu2.cm2
absortion: -917.820092 0.000000 0.000000 0.502488 9.358568 0.491483 2.035652 0.495068 0.607501 2.002503 3.056070 4.012234 7.005293 3.051053 7.235491 21.121013 41.014154 17.723338 127.522634 69.109743 54.006616 115.796052 48.547533 11.776584 178.068917 93.909241 21.576643 36.249520 78.861691 76.511786 555.229983 32.733615 53.807176 59.048884 162.292490 106.828344 8.505952 26.431464 153.691217 41.319217 74.495980 41.076459 279.664055 7.751122 41.226543 110.080676 104.132169 27.636961 201.635243 2.346051 250.939794 53.645342 134.473277 86.924016 37.160978 101.932327 3.431005 0.639474 564.867541 7.928874 892.768723 91.732511 1003.695167 602.117094 781.390651 128.875344 2351.553162 1.784582 10.990843 178.343671 437.982481 38.210121 226.789999 69.483590 505.326129 53.675797 201.540813 321.976030 157.688590 3364.369058 5.299608 1105.639810 3.043221 4.967010 344.901122 97.913407 2747.234071 793.790267 949.656151 39.404228 65.282779 98.509851 55.901627 km.mole-1
oldfreq: -266.865 -17.205 cm-1
newfreq: -261.491 30.913 cm-1
dipolederivX: 0.827 0.090 hartree
dipolederivY: 0.498 0.035 hartree
dipolederivZ: 0.039 -0.005 hartree
irintensity: 910.024 9.135 km.mol-1
redmass: 20.578163 14.675864 hartree
press: 1.000000 atm
temp: 298.150000 k
moi: 4015.8927 11277.9149 13803.2606
symmnumber: 1
pointgroup: NOSYM
temp: 298.15 cal.mol-1.K-1
transl: 43.062 cal.mol-1.K-1
rotat: 34.790 cal.mol-1.K-1
vibrat: 92.758 cal.mol-1.K-1
total: 170.611 cal.mol-1.K-1
transl: 0.889 kcal.mol-1
rotat: 0.889 kcal.mol-1
vibrat: 151.992 kcal.mol-1
total: 153.770 kcal.mol-1
transl: 2.981 cal.mol-1.K-1
rotat: 2.981 cal.mol-1.K-1
vibrat: 80.708 cal.mol-1.K-1
total: 86.670 cal.mol-1.K-1
formula: C6H14NO11P
InChI: InChI=1S/C6H5NO6P.4H2O.HO/c8-7(9)5-1-3-6(4-2-5)13-14(10,11)12;;;;;/h1-4,10H;4*1H2;1H
33 atoms
P  -2.595213 -0.210819 0.032163
O  -1.19933 0.945183 -0.220332
O  -3.629188 0.929765 0.01791
O  -2.138639 -0.886806 1.31286
O  -2.245024 -0.931924 -1.397106
C  0.097962 0.627352 -0.230615
C  1.006739 1.707656 -0.383438
H  0.603585 2.715856 -0.481097
C  2.370056 1.490465 -0.412991
H  3.065634 2.318566 -0.532109
C  2.859824 0.177391 -0.291843
N  4.277227 -0.056954 -0.334084
O  5.053449 0.926091 -0.44439
O  4.703541 -1.237602 -0.260575
C  1.978905 -0.906155 -0.135514
H  2.379641 -1.91316 -0.038564
C  0.612108 -0.688541 -0.103846
H  -0.073728 -1.52201 0.022161
O  -4.258473 -1.640371 -0.230233
H  -3.03715 -1.551893 -1.426616
H  -4.973922 -1.013773 -0.44957
O  -2.989581 2.607418 -2.03459
H  -3.29473 1.993051 -1.303697
H  -2.021086 2.5529 -1.918279
O  -2.641678 2.969499 1.545027
H  -1.710947 2.897151 1.257937
H  -3.057147 2.229368 1.011841
O  -2.264459 -3.542525 1.750799
H  -3.25802 -3.585528 1.792094
H  -2.152642 -2.571504 1.52703
O  -5.023636 -3.139871 1.683186
H  -5.117433 -2.569144 2.469009
H  -4.729405 -2.47421 0.922058
energy: -6.849 -6.835 -6.813 -6.763 -6.650 -6.609 -6.382 -6.165 -6.020 -5.778 -3.484 -1.537 -0.742 -0.402 0.209 0.611 0.861 1.120 1.315 1.635 electronvolt
charge: 1.8558 -0.6957 -0.9333 -0.9042 -0.7550 0.4371 0.1059 -0.1397 0.1693 -0.1107 0.0037 0.6294 -0.5233 -0.5226 0.1733 -0.1191 0.0885 -0.1210 -0.9014 0.2947 0.3300 -0.7948 0.3732 0.3437 -0.7929 0.3437 0.3772 -0.8232 0.3330 0.3650 -0.7923 0.3284 0.3774
mdcq: 1.635935 -0.517023 -0.845877 -0.819142 -0.687919 0.192634 -0.192141 0.188940 -0.102997 0.076812 0.500814 -0.144622 -0.230116 -0.300464 -0.203384 0.186016 -0.160918 0.153844 -0.693487 0.288274 0.236647 -0.866517 0.456146 0.324777 -0.821567 0.336105 0.368557 -0.847693 0.429886 0.221623 -0.902684 0.374682 0.364859
quadrupole: -69.14069917 -7.10842566 13.09042129 10.69900452 18.20060773 58.44169465
eener: -154.5192 electronvolt
kinener: 171.6212 electronvolt
coulombener: -16.3276 electronvolt
xcener: -193.9564 electronvolt
solvener: -7.2609 electronvolt
dispener: -1.1146 electronvolt
total: -201.5574 electronvolt
charge: 0
title: Phosphorus (TZP, 2p frozen)
title: Nitrogen (TZP, 1s frozen)
title: Carbon (TZP, 1s frozen)
title: Oxygen (TZP, 1s frozen)
title: TS Duarte 4Wat TS
charge: -2
converged: GEOMETRY CONVERGED
