program: Gaussian 09
title: Title Card Required
version: AM64L-G09RevD.01
method: RB3LYP
basis: 6-31+G(d,p)
operation: Freq
keyword: #N
keyword: Geom=AllCheck
keyword: Guess=TCheck
keyword: SCRF=Check
keyword: GenChk
keyword: RB3LYP/6-31+G(d,p)
keyword: Freq
keywords: q
keyword: Fre
title: Mulliken charges:
elementType: C C C C C C C C C C C C C C C C C C C H H H H H H H H H H H H H H H H H H H H H H H H H H C H H H H
charge: 0.264494 -0.193960 -0.443656 -0.104267 -0.378247 -0.220591 0.531526 -0.040140 -0.384324 -0.471030 -0.545587 -0.379578 -0.538460 -0.264539 0.077270 -0.395646 0.600076 -0.124900 -0.600482 0.134284 0.137718 0.132805 0.152009 0.126292 0.127472 0.136320 0.127099 0.140468 0.155403 0.139977 0.141667 0.145479 0.133846 0.141950 0.146584 0.145451 0.132001 0.143618 0.153576 0.101964 0.112559 0.134430 0.145301 0.155158 0.132879 -0.549615 0.143502 0.141709 0.140026 0.160112
chargesum: 0.00000
title: Mulliken charges with hydrogens summed into heavy atoms:
elementType: C C C C C C C C C C C C C C C C C C C C
charge: 0.264494 0.076563 -0.173052 0.174034 -0.378247 -0.093120 0.531526 -0.040140 -0.116757 -0.175650 -0.124594 0.054407 -0.109265 -0.162575 0.077270 -0.283087 0.600076 0.142409 -0.139912 -0.124378
dipole: 0.0034 0.5112 -0.0725
dipole: 0.5163
quadrupole: -123.6951 -124.6953 -130.1356
quadrupole: -1.3942 0.9640 -0.4926
quadrupole: 2.4802 1.4801 -3.9603 -1.3942 0.9640 -0.4926
hfenergy: -780.3948081 hartree
pointgroup: C01 [X(C20H30)]
dipole: 0.0030696 0.2024479 0.0163482 debye
polarizability: 282.0350737|0.7519648|226.3597325|-5.276535|10.7183257|173.9066802 unknown
InChI: InChI=1S/C20H30/c1-6-15-14(2)8-10-17-16(15)9-11-18-19(3,4)12-7-13-20(17,18)5/h8,10,18H,6-7,9,11-13H2,1-5H3
charge 0 multiplicity 1
50 atoms
C  3.10375887 0.71854381 -0.23380113
C  3.62071491 -0.39627898 -1.17107989
C  3.13743962 -1.79571399 -0.79243474
C  1.60771508 -1.85903834 -0.73579371
C  0.99851761 -0.84346102 0.26355438
C  1.55599684 0.57208784 -0.0889398
C  -0.53865245 -0.80513776 0.13814426
C  -1.28507929 0.38378675 0.276562
C  0.89629593 1.61875816 0.81092966
C  -0.59420526 1.72060049 0.48770334
C  3.86862618 0.69744912 1.10394486
C  3.41517072 2.06766635 -0.91724447
C  1.30097937 -1.32129563 1.70724423
C  -1.23771718 -2.00396747 -0.05579894
C  -2.69780983 0.35746253 0.18429692
C  -2.62430873 -2.03196608 -0.13553553
C  -3.37551036 -0.85869186 -0.02252426
C  -3.5004813 1.63484295 0.34546323
C  -4.88189264 -0.92830889 -0.13433499
H  3.50303859 -2.52338046 -1.52685838
H  3.27532736 -0.17517747 -2.19121628
H  4.71753095 -0.36163704 -1.20041052
H  1.20181526 -1.65219061 -1.73512884
H  1.30190088 -2.87748577 -0.47684543
H  1.17735324 0.75936072 -1.10700667
H  3.56513417 -2.09924525 0.17048251
H  1.35189583 2.60333282 0.67549227
H  1.0363695 1.35866408 1.86515282
H  -0.70948168 2.3182247 -0.42899854
H  -1.10071662 2.28638203 1.27580736
H  4.91300503 0.98332923 0.93412612
H  3.44466662 1.41031043 1.81816957
H  3.8747242 -0.28427692 1.57846905
H  3.21944836 2.9210604 -0.26120222
H  4.47392992 2.10899479 -1.19706952
H  2.82193573 2.19635913 -1.82981
H  2.36378402 -1.48846357 1.88470886
H  0.93966031 -0.61239938 2.45587581
H  0.78218666 -2.26815709 1.88489539
H  -0.69622446 -2.938739 -0.14438376
H  -3.13354379 -2.97977885 -0.29037563
H  -2.94147314 2.49043398 -0.04369254
H  -5.21085408 -1.9672785 -0.22213657
H  -5.38296534 -0.4943655 0.73730912
H  -4.41100767 1.57587475 -0.25850012
C  -3.89321258 1.91023632 1.80932929
H  -4.49863357 1.09273504 2.21321484
H  -3.00724594 2.00323508 2.44546039
H  -4.47218975 2.83640403 1.89438029
H  -5.24965447 -0.39045234 -1.01666858
