program: Gaussian 09
title: 000032519
version: EM64L-G09RevD.01
frameworkgroup: C1[X(C10H17NO3S)]
method: RPBEPBE
basis: SDD
operation: Freq
keyword: #p
keyword: freq=noraman
keyword: PBEPBE/SDD
title: #p freq=noraman PBEPBE/SDD
converged: NO YES NO NO
title: Mulliken charges:
elementType: S O O O N C C C C C C C C C C H H H H H H H H H H H H H H H H H
charge: 0.177311 -0.306576 -0.290234 -0.283039 -0.619048 0.483628 -0.477643 -0.526294 -0.436302 -0.411255 -0.811074 0.058013 -0.720184 -0.303064 0.298684 0.241925 0.203460 0.215187 0.246344 0.226461 0.217512 0.204836 0.216886 0.254324 0.273254 0.214729 0.259811 0.254138 0.248328 0.214307 0.335266 0.340311
chargesum: 0.00000
title: Mulliken charges with hydrogens summed into heavy atoms:
elementType: S O O O N C C C C C C C C C C
charge: 0.177311 -0.306576 -0.290234 -0.283039 0.056529 0.483628 -0.032258 -0.064763 0.007671 0.010467 -0.283496 0.272741 -0.206235 0.159570 0.298684
polarizability: 1.54997373e+02 4.97466990e-01 1.45252044e+02 -1.20588906e+00 -1.74674210e+00 1.09072078e+02
1716.lowfreq: -21.2168 -12.9178 -0.0003 0.0010 0.0017 5.7792 11.1201 14.9828 37.5071
frequency: -5.0704 12.9328 37.3792 57.0113 110.9563 134.4582 149.1357 176.8392 214.2943 215.9864 233.6280 269.8027 327.2406 330.6792 382.1620 426.6137 445.2625 480.6814 490.7526 495.6234 513.7411 568.4336 621.2618 651.3415 686.4345 700.9258 703.0400 720.2408 755.1869 819.7740 833.4033 835.6271 853.0388 888.5653 903.9236 916.6272 954.9020 966.7723 1008.0540 1016.1958 1017.3836 1048.6877 1055.3722 1066.5750 1083.7435 1097.5296 1122.1768 1161.3214 1173.8710 1198.8464 1206.9831 1212.3242 1225.8044 1228.4801 1247.3468 1262.0837 1277.4821 1293.6742 1304.6977 1311.1372 1315.8277 1324.7996 1338.4183 1383.0399 1418.2210 1424.6045 1453.7296 1461.1223 1462.5287 1466.3300 1481.9069 1587.4960 1685.5216 2987.9588 2991.4062 2992.7820 3005.9454 3007.9094 3010.8410 3016.0636 3017.6436 3054.9659 3070.3085 3076.6390 3081.7301 3085.7569 3094.0153 3095.6420 3559.9467 3718.4147
redmass: 2.7121 7.4291 4.2300 3.3855 4.3790 3.2856 5.4988 4.3615 3.1440 2.0880 3.0287 3.0437 3.6466 5.2950 2.5090 2.8604 2.4951 3.1173 1.2071 3.0691 1.0552 2.0860 5.8031 3.5223 4.5411 5.0132 10.1066 3.8341 1.6227 2.0163 1.7769 4.8580 2.1668 1.8285 2.4699 2.5069 1.9709 1.7320 1.9222 6.8020 1.6457 2.1218 2.2560 3.4267 1.4357 2.4579 2.0321 1.6400 1.3256 1.6141 1.4297 1.3020 1.2150 1.2310 1.4163 1.3245 1.2988 1.7134 1.3873 1.6892 1.4665 1.6163 1.2473 1.7152 1.0950 1.0970 1.0778 1.0872 1.0870 1.0836 1.0977 1.2157 7.4015 1.0765 1.0727 1.0619 1.0599 1.0583 1.0642 1.0596 1.0582 1.0997 1.0996 1.1001 1.1057 1.1039 1.1055 1.1062 1.0445 1.1058
irintensity: 0.0537 2.0284 3.3958 1.4125 1.2833 8.6666 4.8105 3.7022 6.0537 3.5031 1.8517 3.3567 0.2440 0.5980 1.2409 3.5822 10.2542 9.5889 292.5109 13.5758 19.6591 3.1938 2.0755 4.5768 7.1553 3.5274 26.1069 10.1715 1.5573 11.4166 1.1662 28.2161 3.4057 7.6401 5.8176 43.8969 7.0929 49.5384 7.7513 141.8527 1.0978 1.3929 42.8716 18.3309 3.8504 5.3787 2.5481 2.5458 14.7957 9.1489 3.9067 1.4333 1.0533 2.1221 14.7075 0.5594 14.6331 227.7486 38.1357 149.8543 17.5517 14.4993 11.0333 54.3269 3.1870 13.4755 10.1228 19.0302 4.6850 7.6768 8.3350 109.9278 370.5204 18.1834 24.6440 34.6468 44.4920 10.3572 17.4781 42.1091 43.1027 19.3805 19.3078 14.4384 10.1008 51.9373 24.1213 19.4306 55.9359 51.5801
temp: 298.150 k
press: 1.00000 atm
elementType: 16 8 8 8 7 6 6 6 6 6 6 6 6 6 6 1 1 1 1 1 1 1 1 1 1 1 1 1 1 1 1 1
symmnumber: 1
zpe: 694886.6 jmol-1
zpe.correction: 0.264668 hartree
zpe.thermalcorrener: 0.279395 hartree
zpe.thermalcorrenthalpy: 0.280339 hartree
zpe.thermalcorrgfe: 0.221123 hartree
zpe.sumelectzpe: -1068.568142 hartree
zpe.sumelectthermal: -1068.553415 hartree
zpe.sumelectthermalent: -1068.552471 hartree
zpe.sumelectthermalfe: -1068.611687 hartree
dipole: 0.7642 2.5683 -1.4910
dipole: 3.0665
quadrupole: -97.9391 -93.7052 -98.4103
quadrupole: -5.1043 11.7520 -2.5024
quadrupole: -1.2542 2.9796 -1.7254 -5.1043 11.7520 -2.5024
hfenergy: -1068.8328101 hartree
pointgroup: C01 [X(C10H17N1O3S1)]
dipole: -0.3706161 1.0167213 0.533306 debye
polarizability: 155.0356625|0.0868468|145.3045348|-1.0246528|-0.1774153|108.9812979 unknown
InChI: InChI=1S/C10H17NO3S/c11-9(12)13-5-8-6-15-7-10(14-8)3-1-2-4-10/h8H,1-7,11H2
charge 0 multiplicity 1
32 atoms
S  -2.301939 -2.472211 0.677716
O  -0.479852 -0.144487 -0.579109
O  2.280007 0.017554 0.435342
O  4.249394 -0.537947 -0.738991
N  4.089341 1.381522 0.608518
C  -1.906603 0.207471 -0.267614
C  -2.014674 0.91154 1.11121
C  -2.232106 1.330509 -1.30167
C  -1.485715 2.335399 0.827977
C  -2.138912 2.688713 -0.536552
C  -2.791408 -1.034256 -0.4573
C  0.167478 -1.150914 0.283923
C  -0.492929 -2.533192 0.130016
C  1.631068 -1.176979 -0.153774
C  3.612466 0.225737 0.028425
H  -1.478591 0.383275 1.916331
H  -3.083025 0.951261 1.404871
H  -3.234068 1.180537 -1.744416
H  -1.492485 1.259539 -2.117078
H  -0.385439 2.301847 0.726112
H  -1.739134 3.055852 1.625846
H  -3.150994 3.104172 -0.369383
H  -1.562025 3.444179 -1.09793
H  -3.844451 -0.815407 -0.2124
H  -2.727217 -1.393951 -1.499345
H  0.116824 -0.842566 1.348205
H  -0.452364 -2.878925 -0.918054
H  -0.014468 -3.281607 0.784705
H  1.714262 -1.139122 -1.25383
H  2.147023 -2.082756 0.215668
H  3.488404 1.946845 1.20288
H  5.044932 1.665064 0.413502
