program: Gaussian 09
title: Title Card Required
version: ES64L-G09RevD.01
method: RB3LYP
basis: 6-31+G(d,p)
operation: Freq
keyword: #N
keyword: Geom=AllCheck
keyword: Guess=TCheck
keyword: SCRF=Check
keyword: GenChk
keyword: RB3LYP/6-31+G(d,p)
keyword: Freq
keywords: q
keyword: Fre
title: Mulliken charges:
elementType: C C C C C C C C C C C C C C C C C C C C H H H H H H H H H H H H H H H H H H H H H H H H H H H H H H H H
charge: 0.285206 -0.206284 -0.469874 -0.026601 -0.269338 -0.121884 0.060646 -0.132240 -0.353656 -0.423089 -0.565409 -0.392731 -0.493791 -0.597002 0.072526 0.440511 0.057564 -0.558211 -0.160173 -0.555964 0.133664 0.136506 0.133095 0.145423 0.131759 0.130205 0.134611 0.127219 0.139082 0.148174 0.142249 0.140559 0.145215 0.133888 0.142362 0.145972 0.146068 0.144107 0.138534 0.131074 0.126611 0.153668 0.112469 0.144590 0.153951 0.147856 0.104831 0.125575 0.152247 0.142833 0.141427 0.133971
chargesum: -0.00000
title: Mulliken charges with hydrogens summed into heavy atoms:
elementType: C C C C C C C C C C C C C C C C C C C C
charge: 0.285206 0.063318 -0.201599 0.250580 -0.269338 0.008321 0.060646 -0.132240 -0.087355 -0.132666 -0.145747 0.041672 -0.080077 -0.316723 0.177356 0.552980 0.057564 -0.111814 0.117649 -0.137733
chargesum: 0.00000
dipole: 0.1715 0.2841 -0.0354
dipole: 0.3337
quadrupole: -126.8575 -128.3393 -130.1503
quadrupole: 0.3119 -0.4026 -1.0507
quadrupole: 1.5915 0.1097 -1.7013 0.3119 -0.4026 -1.0507
hfenergy: -781.5772174 hartree
pointgroup: C01 [X(C20H32)]
dipole: 0.0677486 0.111701 -0.0131631 debye
polarizability: 276.0043446|-2.7293582|222.870818|-3.9769424|-2.3774517|184.259583 unknown
InChI: InChI=1S/C20H32/c1-6-15-13-17-16(12-14(15)2)8-9-18-19(3,4)10-7-11-20(17,18)5/h12,15,18H,6-11,13H2,1-5H3
charge 0 multiplicity 1
52 atoms
C  -3.2846753 -0.26568914 0.05920757
C  -3.59071616 0.72473223 -1.08972347
C  -2.62849484 1.91087738 -1.16998108
C  -1.17125505 1.44616688 -1.26910729
C  -0.7527174 0.53972569 -0.08336701
C  -1.77241231 -0.64318157 -0.00993025
C  0.64150596 -0.04629756 -0.32142359
C  0.97025923 -1.32421856 -0.02924878
C  -1.30819219 -1.67331917 1.0268651
C  -0.00117859 -2.31877838 0.56133167
C  -3.73034139 0.31643169 1.41529947
C  -4.13133583 -1.53099201 -0.195757
C  -0.65511959 1.40018202 1.20210083
C  1.71430046 0.83951557 -0.92939739
C  2.3268118 -1.8155351 -0.30713847
C  3.12909002 0.50422631 -0.43140327
C  3.36841972 -0.99152847 -0.52549762
C  4.76887698 -1.47055987 -0.77326632
C  3.3850602 0.97985978 1.02021508
C  3.4320223 2.50225497 1.18099428
H  -2.87512881 2.52419918 -2.04507653
H  -3.53688812 0.17134655 -2.03835747
H  -4.62598341 1.07736057 -0.99484025
H  -1.04094142 0.88193714 -2.20287629
H  -0.51286242 2.31858567 -1.33406732
H  -1.66914192 -1.13589911 -0.99002784
H  -2.75915196 2.56444553 -0.29952352
H  -2.06222958 -2.45022162 1.17901348
H  -1.15773831 -1.19441034 2.00050489
H  -0.21915958 -3.08910518 -0.19517745
H  0.48263704 -2.84959884 1.39224244
H  -4.8237405 0.38810574 1.44412653
H  -3.420637 -0.32780676 2.24460167
H  -3.33424548 1.31435608 1.60501741
H  -4.09939414 -2.22931648 0.64589657
H  -5.18068168 -1.25432721 -0.34882085
H  -3.78999007 -2.06213569 -1.09161892
H  -0.53467694 0.78140743 2.09413534
H  0.22097474 2.05280692 1.14093418
H  -1.52385712 2.04269964 1.34894921
H  1.50340802 1.89528877 -0.74078522
H  1.68673255 0.72130384 -2.02424974
H  3.84930048 1.02233471 -1.08011294
H  4.83944679 -2.56096258 -0.71978353
H  5.12502469 -1.15193951 -1.76207522
H  5.468034 -1.04670167 -0.0397632
H  2.48018279 -2.89412479 -0.30041195
H  4.3371375 0.55713348 1.36300298
H  2.60749968 0.55462982 1.66589058
H  3.65797457 2.77983347 2.21602336
H  4.20571019 2.94208116 0.54022021
H  2.47908845 2.97331238 0.91933092
