program: Gaussian 09
title: Title Card Required
version: ES64L-G09RevD.01
method: RB3LYP
basis: 6-31+G(d,p)
operation: Freq
keyword: #N
keyword: Geom=AllCheck
keyword: Guess=TCheck
keyword: SCRF=Check
keyword: GenChk
keyword: RB3LYP/6-31+G(d,p)
keyword: Freq
keywords: q
keyword: Fre
title: Mulliken charges:
elementType: C C C C C C C C C C C C C C C C C C C C H H H H H H H H H H H H H H H H H H H H H H H H H H H H H H H H
charge: 0.223728 -0.212836 -0.536920 -0.014409 -0.154834 -0.283489 0.275872 -0.187835 -0.319523 -0.457867 -0.536453 -0.381830 -0.511776 -0.803496 0.073582 0.425052 0.049729 -0.377067 -0.240156 -0.434147 0.133246 0.136681 0.132562 0.141031 0.131974 0.131213 0.135020 0.125785 0.138463 0.151647 0.136089 0.140798 0.145406 0.133648 0.142067 0.145665 0.146156 0.145630 0.143607 0.132215 0.151713 0.125878 0.117721 0.145390 0.149664 0.153288 0.101971 0.128135 0.131587 0.130778 0.154051 0.145598
chargesum: -0.00000
title: Mulliken charges with hydrogens summed into heavy atoms:
elementType: C C C C C C C C C C C C C C C C C C C C
charge: 0.223728 0.056406 -0.268654 0.258596 -0.154834 -0.152276 0.275872 -0.187835 -0.055275 -0.170131 -0.116602 0.052058 -0.090324 -0.525905 0.175553 0.542773 0.049729 0.071275 0.019566 -0.003721
chargesum: 0.00000
dipole: 0.1561 -0.3681 -0.0473
dipole: 0.4026
quadrupole: -126.9100 -127.4517 -130.9446
quadrupole: -0.6101 0.0148 1.0472
quadrupole: 1.5254 0.9837 -2.5091 -0.6101 0.0148 1.0472
hfenergy: -781.575032 hartree
pointgroup: C01 [X(C20H32)]
dipole: 0.0617683 -0.1445921 -0.0192847 debye
polarizability: 273.6962139|1.3126488|216.295296|0.3556116|5.2594895|189.2931483 unknown
InChI: InChI=1S/C20H32/c1-6-15-13-17-16(12-14(15)2)8-9-18-19(3,4)10-7-11-20(17,18)5/h12,15,18H,6-11,13H2,1-5H3
charge 0 multiplicity 1
52 atoms
C  -3.11332578 0.23225598 0.45139402
C  -3.26335787 -1.27402973 0.76354044
C  -2.53233084 -2.18668051 -0.22048149
C  -1.04272905 -1.83849819 -0.30969246
C  -0.78968209 -0.36385949 -0.71551261
C  -1.59675295 0.55008736 0.2654502
C  0.69535237 0.003832 -0.58817473
C  1.11910513 1.21208429 -0.15579357
C  -1.27992584 2.02529615 -0.00945348
C  0.18857343 2.30603442 0.30984309
C  -3.99281955 0.62943223 -0.7503582
C  -3.64225149 1.00374718 1.67990301
C  -1.15138445 -0.19803974 -2.21487377
C  1.74552018 -0.96241947 -1.1086631
C  2.55467408 1.52120342 -0.10404175
C  3.11509116 -0.85953756 -0.41130075
C  3.51824731 0.58959303 -0.22407173
C  4.9826527 0.90767323 -0.11840061
C  3.20040592 -1.65537553 0.91897355
C  2.29442761 -1.17712128 2.05843974
H  -2.64132889 -3.23131082 0.09524338
H  -2.86076645 -1.45619326 1.77050718
H  -4.33023006 -1.52953185 0.80456111
H  -0.57660129 -2.02522877 0.66718265
H  -0.55970797 -2.51375375 -1.02318421
H  -1.15675058 0.3243119 1.25000021
H  -2.99642412 -2.1232502 -1.21201087
H  -1.91342514 2.68331196 0.59119409
H  -1.48568693 2.27011488 -1.05696622
H  0.31110217 2.43054943 1.39742321
H  0.5032907 3.26083847 -0.13277829
H  -5.05075135 0.53731929 -0.47877726
H  -3.81701156 1.66926916 -1.04370846
H  -3.82750456 0.00427501 -1.62842517
H  -3.71586538 2.07959458 1.4956555
H  -4.64622153 0.64900723 1.93953658
H  -2.99649029 0.85129409 2.5522873
H  -1.12518868 0.84910007 -2.52431306
H  -0.42134072 -0.73707063 -2.82708962
H  -2.13438363 -0.60183981 -2.45988218
H  1.89130545 -0.7600251 -2.18161121
H  1.40257758 -1.9984212 -1.04397429
H  3.84890178 -1.3296896 -1.08047056
H  5.15075836 1.97554976 0.04888579
H  5.45216574 0.35786898 0.7078278
H  5.51736765 0.61455363 -1.03172828
H  2.83170434 2.5603233 0.07025546
H  4.2425638 -1.63785465 1.26263908
H  2.9755487 -2.70603657 0.69046497
H  2.49610213 -1.74852815 2.97105916
H  2.46080244 -0.11803686 2.27790583
H  1.23681228 -1.29803432 1.81208061
