program: Gaussian 09
title: 000032469
version: EM64L-G09RevD.01
frameworkgroup: C1[X(C7H15N3O2S)]
method: RPBEPBE
basis: SDD
operation: Freq
keyword: #p
keyword: freq=noraman
keyword: PBEPBE/SDD
title: #p freq=noraman PBEPBE/SDD
converged: YES YES NO NO
title: Mulliken charges:
elementType: S O O N N N C C C C C C C H H H H H H H H H H H H H H H
charge: -0.012099 -0.239334 -0.216172 -0.341903 -0.362761 -0.610045 -0.419815 -0.375300 -0.369687 -0.277745 -0.712197 0.130570 0.121636 0.209068 0.233428 0.212927 0.211696 0.221232 0.265328 0.258787 0.196860 0.227761 0.356504 0.279985 0.252835 0.094796 0.324277 0.339368
chargesum: 0.00000
title: Mulliken charges with hydrogens summed into heavy atoms:
elementType: S O O N N N C C C C C C C
charge: 0.082697 -0.239334 -0.216172 -0.083116 -0.006257 0.053601 0.022681 0.049323 0.116873 0.146877 -0.179378 0.130570 0.121636
polarizability: 1.45085230e+02 1.81647224e+00 1.27269454e+02 -1.17190609e+01 -8.25371598e-01 8.99309798e+01
1716.lowfreq: -14.2335 -10.9247 -7.4928 -0.0027 -0.0026 0.0017 16.1545 22.5537 39.3483
frequency: 15.8595 22.1478 38.6660 45.9329 61.9407 73.5330 100.6790 142.1731 169.4146 187.8898 203.3354 213.9319 256.4191 287.8641 334.0263 353.3054 368.4471 424.3291 515.5200 562.3457 586.9405 619.1683 679.8900 684.8114 714.0203 744.7459 747.5835 768.0689 815.5822 830.1133 838.0267 879.0748 961.0459 978.0397 1030.2431 1050.7692 1056.6879 1068.5065 1097.1064 1104.0003 1132.7188 1162.9285 1187.9171 1217.1163 1237.4766 1260.2634 1264.8336 1279.2495 1311.7926 1324.2240 1345.2529 1357.6243 1379.8033 1441.4416 1449.3314 1462.2816 1467.3932 1479.4663 1480.4847 1494.0508 1587.2351 1619.3575 1648.2677 2430.2567 2886.7509 2898.8902 2983.5262 2991.5554 2998.7173 3025.1067 3034.6524 3051.7542 3080.7696 3109.1671 3413.3171 3420.7516 3499.8121 3656.7482
redmass: 8.2561 3.4865 2.7228 8.3955 3.8703 3.3835 3.4671 3.6530 2.7079 2.3073 2.5110 1.2228 4.4855 5.2440 4.0670 3.7263 5.3586 3.9753 1.1333 2.3195 2.9646 1.9465 2.4224 3.0709 1.3918 1.3044 1.5015 5.1630 1.1836 1.9368 1.5144 2.5274 1.9614 2.2210 2.1233 1.9211 2.2579 2.9348 2.2733 2.0102 3.0783 1.2258 1.9540 1.4265 1.2986 1.2454 1.1781 1.1320 2.7233 1.2658 1.3967 1.3508 1.3844 1.1973 1.0894 1.6098 1.2023 1.0838 1.1168 1.0838 1.4507 5.6497 4.9804 1.0383 1.0708 1.0700 1.0664 1.0699 1.0829 1.0719 1.0768 1.0993 1.0975 1.1055 1.0740 1.0789 1.0446 1.1041
irintensity: 1.7616 6.3852 7.8619 3.7649 1.0682 2.1640 2.2583 2.9733 3.7500 0.2043 10.5163 25.5855 9.0566 5.0436 8.9721 4.7363 0.8468 5.4891 140.2863 24.3077 6.6702 98.5471 63.1912 40.7599 43.5948 4.9391 9.9739 12.3361 100.6001 1.2569 19.7611 15.4641 13.6051 9.1373 19.3727 3.6130 27.8126 5.9847 9.6463 7.4399 33.1721 28.7453 31.3464 76.8974 12.0922 23.1970 24.0549 6.7122 63.5831 4.6371 3.5621 1.3819 4.1492 44.6836 12.4835 210.8793 29.2929 5.8217 17.6237 24.2837 71.9915 205.5917 304.7648 28.2911 57.4473 122.3933 29.9098 19.8319 66.4455 8.8961 30.9908 42.9080 11.6779 14.3379 0.3945 184.4813 20.3351 21.3681
temp: 298.150 k
press: 1.00000 atm
elementType: 16 8 8 7 7 7 6 6 6 6 6 6 6 1 1 1 1 1 1 1 1 1 1 1 1 1 1 1
symmnumber: 1
zpe: 596365.2 jmol-1
zpe.correction: 0.227143 hartree
zpe.thermalcorrener: 0.243116 hartree
zpe.thermalcorrenthalpy: 0.244060 hartree
zpe.thermalcorrgfe: 0.179775 hartree
zpe.sumelectzpe: -987.459954 hartree
zpe.sumelectthermal: -987.443981 hartree
zpe.sumelectthermalent: -987.443037 hartree
zpe.sumelectthermalfe: -987.507322 hartree
dipole: -6.9304 4.8675 2.5618
dipole: 8.8479
quadrupole: -120.0308 -86.5096 -82.0256
quadrupole: -0.4900 7.8243 -8.4721
quadrupole: -23.8422 9.6791 14.1631 -0.4900 7.8243 -8.4721
hfenergy: -987.6870971 hartree
pointgroup: C01 [X(C7H15N3O2S1)]
dipole: 2.9021504 -1.239638 1.4691578 debye
polarizability: 141.4654254|6.6081292|128.5263848|15.3713921|-1.9881857|92.2938545 unknown
InChI: InChI=1S/C7H15N3O2S/c8-6(11)7(12)10-3-1-2-9-4-5-13/h9-10,13H,1-5,8H2
charge 0 multiplicity 1
28 atoms
S  4.791703 2.351567 -0.040875
O  -3.254964 -0.695653 -0.524108
O  -2.899022 2.251258 -1.189866
N  1.966037 -0.742303 0.074117
N  -0.922457 -0.504461 -0.395588
N  -1.543551 2.092916 0.701013
C  0.236913 -2.495878 0.616025
C  1.283511 -1.495248 1.161114
C  -0.62264 -1.935693 -0.551353
C  3.021828 0.18718 0.546953
C  3.514661 1.072669 -0.608257
C  -2.20717 0.005605 -0.430681
C  -2.260542 1.551958 -0.360765
H  0.736959 -3.419197 0.262183
H  -0.415646 -2.79077 1.458704
H  1.999035 -2.040356 1.821825
H  0.773086 -0.74853 1.801183
H  -0.090342 -2.080396 -1.511675
H  -1.585052 -2.470174 -0.621599
H  2.330078 -1.379949 -0.650293
H  3.887937 -0.343959 1.012218
H  2.586957 0.831816 1.333705
H  -0.090724 0.102948 -0.41716
H  2.684612 1.668097 -1.021288
H  3.955534 0.475401 -1.425146
H  5.782342 1.439082 0.288631
H  -1.13848 1.50293 1.427125
H  -1.564604 3.104842 0.836659
