program: Gaussian 09
title: /home/michael/molsimp_comfiles/Fe_32a_35_VAC/Fe_32a_35_VAC.com auto generated
version: ES64L-G09RevE.01
frameworkgroup: C1[X(C15H9FeN5O4)]
method: UTPSSh
basis: Gen
operation: Freq
keyword: #P
keyword: Geom=AllCheck
keyword: Guess=TCheck
keyword: SCRF=Check
keyword: GenChk
keyword: UTPSSh/ChkBas
keyword: Freq
title: /home/michael/molsimp_comfiles/Fe_32a_35_VAC/Fe_32a_35_VAC.com auto ge
converged: YES YES YES YES
polarizability: 4.15031786e+02 3.95640762e+01 3.38298145e+02 -3.07201078e+01 3.49058862e+00 2.74637112e+02
1716.lowfreq: -17.9016 0.0008 0.0009 0.0010 21.8656 22.7404 26.7918 32.8763 39.6367
frequency: 21.2990 30.2525 34.9775 63.6427 80.6989 90.7599 101.8111 120.4683 139.4778 157.6365 168.2985 173.2269 198.0861 209.2308 217.8697 244.1421 247.6815 282.4904 290.4320 358.4602 377.8242 405.8880 412.8965 418.7944 425.5290 433.5224 473.1786 476.1881 526.6226 551.1632 581.4632 636.7022 654.8121 659.4885 689.4683 690.6676 716.0713 768.6806 773.4852 798.4958 801.1214 808.2313 821.1628 830.2227 858.6214 858.7036 916.5605 960.1542 1009.8015 1014.9221 1022.9403 1024.0332 1024.4768 1028.4966 1028.7203 1031.8521 1078.3637 1092.1381 1103.0744 1123.5663 1135.3208 1161.9777 1169.3691 1191.3507 1208.5162 1271.0950 1274.3126 1309.8136 1310.6421 1330.7291 1365.0247 1366.6104 1386.7544 1440.2902 1444.3492 1459.3503 1482.5150 1488.8850 1497.1826 1565.5366 1579.9432 1606.5324 1613.4655 1616.6032 1619.5709 1634.6193 1639.3129 3222.2147 3222.3047 3224.4581 3231.3044 3234.2494 3240.9735 3245.0350 3257.5924 3258.3340
redmass: 6.8913 7.8497 7.5950 10.3463 5.2058 5.2152 8.1277 12.0746 8.7811 8.4260 5.7932 5.5321 7.2166 12.2056 8.3148 8.0034 20.0751 20.3232 7.4344 8.3897 13.6302 4.8353 3.3183 4.4549 10.9385 4.1206 7.2570 6.1391 11.5848 2.6123 7.3577 7.9148 7.9879 8.0342 7.6447 8.0760 11.2058 1.7990 3.7703 6.8567 12.4303 8.1084 1.7177 1.4099 2.5373 3.3467 8.1221 1.3965 1.3760 1.3674 1.4247 8.1224 1.4726 1.3449 8.9668 7.7147 4.3252 1.5662 2.4183 1.4850 1.3531 2.3792 1.1538 6.5541 2.2652 4.1069 1.6722 7.6049 10.5071 1.9707 2.4715 8.1067 5.1343 3.7284 2.2987 1.8555 2.1943 4.4175 2.9324 12.8445 11.0698 4.8932 4.7575 5.4406 7.2444 6.7117 6.8308 1.0897 1.0920 1.0919 1.0931 1.0931 1.0927 1.0967 1.0982 1.0984
irintensity: 0.3275 0.1467 0.4348 43.1275 23.8285 1.7407 4.7694 1.5110 1.2317 1.4483 2.1629 2.9401 5.1320 51.9908 64.9323 36.3969 129.6945 49.0671 0.7957 2.0849 4.3418 0.1737 0.3605 1.1871 37.7484 19.0353 0.0388 0.0170 9.8381 0.0097 5.1921 0.2399 31.4796 36.1974 50.5806 52.1533 178.7884 69.2675 104.7412 1.5319 25.9284 0.1259 0.2645 34.5297 9.9957 0.2195 50.4104 0.0029 0.0157 0.0981 0.4227 13.5101 0.4190 0.0859 5.1990 19.8300 0.1990 38.2563 0.1853 15.2827 0.0053 20.4811 0.0554 150.5890 2.3490 1.5888 38.2862 109.2221 4.6506 1.2893 77.5087 971.1025 16.8724 41.1578 412.6326 0.3835 18.1531 0.7922 2.0696 1965.6880 731.9931 163.8612 117.4367 246.2840 47.8230 29.9422 15.0214 4.1754 17.1817 15.7729 4.1593 4.2339 0.8852 3.2824 1.2028 1.2628
temp: 298.150 k
press: 1.00000 atm
elementType: 26 8 6 8 6 6 6 6 6 6 8 8 7 1 1 1 6 6 7 6 6 7 6 6 6 7 7 6 1 1 1 1 1 1
symmnumber: 1
zpe: 606777.0 jmol-1
zpe.correction: 0.231109 hartree
zpe.thermalcorrener: 0.251658 hartree
zpe.thermalcorrenthalpy: 0.252602 hartree
zpe.thermalcorrgfe: 0.178300 hartree
zpe.sumelectzpe: -1275.118501 hartree
zpe.sumelectthermal: -1275.097951 hartree
zpe.sumelectthermalent: -1275.097007 hartree
zpe.sumelectthermalfe: -1275.171309 hartree
dipole: -6.3663 0.7421 -0.9808
dipole: 6.4840
quadrupole: -113.6217 -142.5184 -182.7493
quadrupole: 28.2878 -9.1023 -55.2411
quadrupole: 32.6747 3.7781 -36.4528 28.2878 -9.1023 -55.2411
hfenergy: -1275.3496096 hartree
pointgroup: C01 [X(C15H9Fe1N5O4)]
dipole: 2.5202005 0.3340308 0.2112541 debye
polarizability: 411.6972698|-48.8774837|333.5401102|-22.9769668|-18.0472179|282.7296636 unknown
InChI: InChI=1S/C8H6N4.C7H3NO4.Fe/c1-3-9-7(10-4-1)8-11-5-2-6-12-8;9-6(10)4-2-1-3-5(8-4)7(11)12;/h1-6H;1-3H;/q;-2;+2
charge 0 multiplicity 5
34 atoms
Fe -0.06309854 -0.8079862 -0.12445951
O  -2.521216 -1.66082388 3.18338009
C  -1.99382168 -1.32920093 2.09596561
O  -0.76122279 -1.54363731 1.77029433
C  -2.81855199 -0.62204049 1.04497836
C  -4.1636693 -0.26997294 1.16402642
C  -4.77366395 0.38535185 0.08905318
C  -4.03703609 0.66589358 -1.06624852
C  -2.69610863 0.27897126 -1.10672815
C  -1.74672843 0.49052548 -2.26436267
O  -0.55623335 0.02921338 -2.08265389
O  -2.1489236 1.07657249 -3.29901387
N  -2.12423397 -0.34377376 -0.06741273
H  -4.71189805 -0.50145429 2.06976125
H  -5.81738044 0.67463841 0.15149353
H  -4.48668108 1.17057719 -1.91335396
C  4.0613892 -2.56319793 -0.60857995
C  2.68271858 -2.41349343 -0.51645044
N  2.12741309 -1.22031147 -0.2376474
C  2.95616928 -0.17303518 -0.05014058
C  2.30285613 1.13430357 0.25131052
N  0.95669054 1.12231851 0.31897904
C  0.33535365 2.28526006 0.58173848
C  1.05492141 3.45738571 0.78503369
C  2.44183217 3.36534109 0.69440768
N  3.07580081 2.21068231 0.42637797
N  4.29012543 -0.22322082 -0.11730477
C  4.83105037 -1.42150833 -0.39829649
H  4.51210603 -3.5211212 -0.83565416
H  1.99976047 -3.24239781 -0.66627562
H  -0.74808805 2.25753303 0.6257236
H  0.55896128 4.39552753 1.00037047
H  3.07244967 4.23686988 0.83734365
H  5.91415781 -1.45728937 -0.45515515
