program: Gaussian 09
title: /home/michael/molsimp_comfiles/Ru_pbp_1_VAC/Ru_pbp_1_VAC.com auto generated
version: ES64L-G09RevE.01
frameworkgroup: C1[X(C28H18N6O4Ru)]
method: UTPSSh
basis: Gen
operation: Freq
keyword: #PGeom=AllCheck
keyword: Guess=TCheck
keyword: SCRF=Check
keyword: GenChk
keyword: UTPSSh/ChkBas
keyword: Freq
title: /home/michael/molsimp_comfiles/Ru_pbp_1_VAC/Ru_pbp_1_VAC.com auto gene
converged: YES YES YES YES
polarizability: 8.36363353e+02 -6.48017940e-03 7.88848570e+02 2.00290072e-02 8.17871050e+00 5.92573192e+02
1716.lowfreq: -23.4644 0.0005 0.0006 0.0007 4.2441 14.5472 20.6516 21.1573 23.9888
frequency: 20.0908 21.0251 23.2845 33.8315 36.3355 36.4406 47.5289 62.1641 81.0742 101.1547 112.2714 129.5607 139.1444 146.3156 152.3915 162.3206 179.8535 180.1009 181.3188 191.2130 199.2883 206.1215 245.0655 275.1992 290.0543 291.9987 302.6323 303.1254 339.0350 341.5605 382.1056 390.0708 392.0309 392.2793 419.5328 432.6168 465.1432 473.5086 475.7552 477.6955 487.3914 493.8320 500.0307 517.3184 530.4955 531.0444 532.0066 544.9831 569.5351 583.7216 587.6333 636.6356 637.8083 662.5892 662.7216 676.0861 698.7955 703.2380 717.9589 758.2207 760.2969 766.0443 769.0795 771.6399 779.0912 783.1384 784.2305 789.1813 789.6508 831.4675 832.1255 840.8985 844.4157 845.6085 852.3781 854.5753 889.3990 889.6832 914.4070 947.4955 951.8656 973.1441 973.9490 983.2952 983.3748 994.9517 995.0044 1008.0526 1011.4987 1019.8264 1019.8330 1035.4196 1035.5889 1038.4134 1055.2607 1077.1729 1094.7207 1100.2125 1110.0564 1119.8984 1153.4911 1154.4144 1168.4225 1168.4392 1175.1380 1175.5883 1178.6188 1184.8745 1215.0342 1217.9673 1237.8544 1239.6543 1283.8626 1284.3770 1302.1451 1303.3241 1305.4271 1315.9153 1331.7014 1333.6548 1336.1633 1348.1151 1350.9619 1405.3673 1434.8150 1434.9995 1443.5117 1450.5366 1451.4592 1477.8992 1479.8172 1495.1906 1513.0159 1537.2063 1538.1013 1559.9595 1565.9117 1579.1994 1581.2521 1582.7990 1593.4763 1624.1184 1625.1058 1639.0871 1641.4244 1661.8296 1661.8587 3207.8806 3207.8920 3213.9897 3214.0026 3222.9499 3222.9599 3223.8977 3226.4889 3228.5929 3228.6206 3230.9451 3230.9909 3238.1057 3240.1031 3243.6728 3244.8215 3255.3459 3256.0291
redmass: 6.7917 7.2096 7.1658 4.4566 4.6340 5.8380 11.0180 6.8134 7.1098 6.7313 6.2346 8.5238 6.0882 9.3565 8.7390 9.2178 4.3380 4.2043 7.4865 6.7989 5.2787 12.7988 5.9882 9.9232 6.1295 6.8909 5.6855 13.2883 10.7509 8.7030 7.4446 3.6296 3.5561 4.5404 6.7006 9.2878 5.4365 3.6194 3.1127 3.4862 9.9886 4.0985 3.7493 3.8485 7.1912 7.0495 7.8602 8.0964 8.4064 5.4900 6.0459 7.3530 7.3493 4.3203 7.5673 4.0551 9.5142 7.6123 8.4175 2.4177 10.2363 1.3729 1.3630 1.7530 3.3496 5.4558 5.5867 3.6356 3.8894 2.7071 10.6380 5.8649 6.0201 2.7566 1.3457 1.3586 1.4921 1.4924 6.7195 1.3716 1.4096 5.2212 5.0754 1.3192 1.3198 1.3587 1.3596 1.3267 1.3195 1.3077 1.3077 2.3243 2.3013 7.6525 6.9018 3.5405 3.0327 1.6025 1.8845 5.2928 1.5731 1.5607 1.3004 1.2971 1.2512 1.2611 1.3064 2.0174 1.7409 2.1127 2.7740 2.8144 1.7882 1.7970 4.9920 2.5404 2.6264 12.2727 3.2031 3.7152 5.5900 4.2276 3.2640 2.7428 5.5567 5.7577 2.9237 2.0921 2.0892 2.4046 2.3970 2.8229 3.0449 3.0971 3.1209 12.0630 11.5958 6.3783 6.5352 5.8985 6.3539 5.8979 5.8632 6.5172 5.3858 5.7609 5.7602 1.0872 1.0872 1.0893 1.0893 1.0953 1.0953 1.0893 1.0887 1.0917 1.0917 1.0986 1.0986 1.0926 1.0926 1.0976 1.0969 1.0957 1.0958
irintensity: 5.1221 0.9898 12.0011 0.4222 2.3731 6.7801 19.6935 0.2600 0.0024 9.8070 9.8515 2.5161 4.1636 12.0728 0.8546 3.9588 11.1617 0.0300 18.9455 0.1749 0.3346 79.2078 0.1915 6.5374 7.9549 21.5040 0.0011 1.8354 0.8372 49.6653 1.6221 0.0041 5.2595 42.7949 2.5270 33.6313 11.1733 0.0379 11.6418 0.0267 11.6069 0.8796 0.0116 0.4768 35.9103 0.0577 11.3627 22.2211 10.2812 0.0104 2.2487 0.7975 7.1723 0.0008 1.5928 0.2127 53.6535 1.0285 38.1845 0.1437 128.7213 0.0245 102.1189 150.4054 1.5789 21.4685 0.0181 0.0860 13.6621 19.6916 18.7053 15.5122 4.9289 0.5674 0.0078 181.0436 0.0095 10.3556 26.6459 0.0524 0.0015 30.9836 2.5267 0.1577 0.7698 0.0440 9.6197 0.4630 0.5644 0.0000 0.0000 0.1281 2.1353 23.8465 55.5356 236.9417 32.7004 0.3043 8.6671 22.4324 9.2885 17.1100 9.0298 0.8577 44.9953 21.8858 10.0657 36.2761 45.7562 29.8881 35.0104 10.4729 8.0195 9.4332 222.5940 0.9293 69.2378 26.0822 8.3175 154.3290 152.8367 6.1596 1.4647 213.1488 73.0559 40.1855 4.0664 19.9312 22.5674 40.2767 0.4386 15.2489 28.0108 137.3003 9.6339 3394.0592 15.9903 171.8414 47.0799 13.8249 47.4464 98.5474 11.8536 48.9431 5.7158 5.0519 0.7724 1.5291 0.0628 1.1727 6.0346 22.8983 11.1311 1.3543 1.4961 0.0110 1.0776 39.3851 27.7422 0.2590 0.0737 3.7308 6.5005 8.2963 7.5389
temp: 298.150 k
press: 1.00000 atm
elementType: 44 8 6 8 6 6 6 6 6 6 6 6 6 6 6 8 8 7 7 1 1 1 1 1 1 7 6 6 6 6 6 6 6 6 7 1 1 1 1 1 1 7 6 6 6 6 6 6 6 6 7 1 1 1 1 1 1
symmnumber: 1
zpe: 1089564.8 jmol-1
zpe.correction: 0.414993 hartree
zpe.thermalcorrener: 0.445747 hartree
zpe.thermalcorrenthalpy: 0.446691 hartree
zpe.thermalcorrgfe: 0.350948 hartree
zpe.sumelectzpe: -1800.972392 hartree
zpe.sumelectthermal: -1800.941638 hartree
zpe.sumelectthermalent: -1800.940694 hartree
zpe.sumelectthermalfe: -1801.036437 hartree
dipole: 0.0004 19.6576 2.6790
dipole: 19.8393
quadrupole: -106.5310 -169.6137 -297.7987
quadrupole: 0.0004 -0.0167 14.5078
quadrupole: 84.7835 21.7008 -106.4842 0.0004 -0.0167 14.5078
hfenergy: -1801.387385 hartree
pointgroup: C01 [X(C28H18N6O4Ru1)]
dipole: -2.488356 7.3974867 -0.0966402 debye
polarizability: 603.2052874|-43.7873176|778.8824107|-12.4505357|-2.5695454|835.697416 unknown
InChI: InChI=1S/C12H6N2O4.2C8H6N2.Ru/c15-11(16)9-5-1-3-7(13-9)8-4-2-6-10(14-8)12(17)18;2*1-2-4-8-7(3-1)5-6-9-10-8;/h1-6H;2*1-6H;/q-3;2*-1;+5
charge 0 multiplicity 1
57 atoms
Ru 0.00817358 0.0917942 -0.04708611
O  4.16031252 0.92872946 0.17365443
C  2.90939714 0.8398447 0.10789177
O  2.25019425 -0.2712726 0.06844422
C  2.0875564 2.1115568 0.07064669
C  2.58685655 3.41143857 0.10248505
C  1.68459578 4.48153856 0.06014605
C  0.30985386 4.24185571 -0.01269869
C  -0.15118651 2.92240656 -0.0426677
C  -1.54968328 2.45736778 -0.11791337
C  -2.70815388 3.23819676 -0.17503465
C  -3.95205857 2.60591143 -0.24306322
C  -4.03455884 1.20759767 -0.25374189
C  -2.85740193 0.46576636 -0.1954437
C  -2.74773791 -1.04495545 -0.19652617
O  -1.55125655 -1.53267494 -0.13607933
O  -3.79755938 -1.7313329 -0.2545923
N  -1.66216289 1.0915013 -0.13000227
N  0.75619686 1.89474313 0.00017488
H  3.65669456 3.57540309 0.15905153
H  2.0511949 5.5016226 0.08382923
H  -0.39466955 5.06494607 -0.04581423
H  -2.63512968 4.31972562 -0.1663084
H  -4.85612221 3.20297643 -0.28770234
H  -4.98986012 0.69840263 -0.30608504
N  -0.05250191 -0.0682116 2.02176591
C  -0.36577849 0.94922934 2.87982714
C  -0.3888475 0.77210986 4.24444378
C  -0.07907774 -0.49998246 4.7655313
C  -0.06992223 -0.82673585 6.14648129
C  0.24723896 -2.10882096 6.54180903
C  0.5680597 -3.10998708 5.58361487
C  0.56950241 -2.82472409 4.23659703
C  0.24335359 -1.51062966 3.80271988
N  0.24946295 -1.2697891 2.46213706
H  -0.59339412 1.90228454 2.42080946
H  -0.64170959 1.60010142 4.89809954
H  -0.31544937 -0.05769296 6.87209835
H  0.25438225 -2.364232 7.59653953
H  0.81380125 -4.11035212 5.92482463
H  0.81161994 -3.57680831 3.49298158
N  0.16441248 -0.04942279 -2.11226993
C  -0.05782642 0.97590351 -2.98913571
C  0.06188564 0.81112759 -4.35024114
C  0.4248705 -0.45638493 -4.84757975
C  0.57834004 -0.77066802 -6.22291705
C  0.93557471 -2.04930248 -6.59451643
C  1.15497558 -3.05924079 -5.61712617
C  1.01559566 -2.7861496 -4.27480573
C  0.64535526 -1.47585375 -3.8655142
N  0.51122406 -1.24714617 -2.52951482
H  -0.33248529 1.92492027 -2.54783239
H  -0.12160132 1.64513737 -5.01922201
H  0.40963462 0.00503292 -6.96322621
H  1.05293607 -2.29520062 -7.64499345
H  1.43542453 -4.05661718 -5.93982245
H  1.17902464 -3.54504982 -3.51679736
