program: Gaussian 09
title: 000032456
version: EM64L-G09RevD.01
frameworkgroup: C1[X(C10H11Cl6N3S)]
method: RPBEPBE
basis: SDD
operation: Freq
keyword: #p
keyword: freq=noraman
keyword: PBEPBE/SDD
title: #p freq=noraman PBEPBE/SDD
converged: YES YES NO NO
title: Mulliken charges:
elementType: Cl Cl Cl Cl Cl Cl S N N N C C C C C C C C C C H H H H H H H H H H H
charge: 0.121007 0.149628 0.121285 0.125511 0.133565 0.125858 0.330688 0.072848 0.079404 0.093167 -0.341521 -0.341216 -0.350891 -0.668457 -0.690552 -0.383965 0.290254 0.261568 -0.780063 -0.781666 0.193955 0.193988 0.214333 0.214386 0.197508 0.197543 0.289275 0.289136 0.211412 0.211398 0.220616
chargesum: 0.00000
title: Mulliken charges with hydrogens summed into heavy atoms:
elementType: Cl Cl Cl Cl Cl Cl S N N N C C C C C C C C C C
charge: 0.121007 0.149628 0.121285 0.125511 0.133565 0.125858 0.330688 0.072848 0.079404 0.093167 0.046421 0.087502 0.044159 -0.090046 -0.047125 -0.383965 0.290254 0.261568 -0.780063 -0.781666
polarizability: 2.91618390e+02 1.40010028e+01 2.08368274e+02 3.20120127e-02 2.31224600e-03 1.53875874e+02
1716.lowfreq: -6.3759 -3.6128 -0.0025 -0.0017 0.0014 4.9271 6.6683 9.9607 18.5481
frequency: -3.0664 9.5983 18.4533 29.8138 32.0580 57.6501 74.4563 78.1406 98.4077 103.5185 112.4009 135.6263 142.6613 151.9596 154.5964 180.0555 204.9965 207.9401 224.0382 233.6284 233.8186 252.6089 276.6234 302.7936 304.4618 310.3561 364.0457 374.8066 397.8425 419.7912 460.7753 492.9785 605.8906 623.8644 654.6067 681.4240 696.9195 716.0103 730.6378 752.8307 765.9744 769.4144 773.3834 828.5522 842.0419 896.4958 899.9578 911.2636 950.2920 991.4610 1009.4360 1055.6807 1073.1251 1073.9392 1113.2540 1163.5231 1195.5307 1215.7048 1239.2955 1251.3058 1282.0574 1288.6708 1292.0226 1295.3416 1326.3956 1339.5273 1354.2715 1395.0462 1417.2993 1437.5686 1458.1186 1466.6135 1470.1883 1479.5978 1479.8832 1488.1706 2962.2840 2971.3504 2975.8099 2982.9665 3002.0956 3024.5160 3042.0885 3047.3916 3072.3377 3075.8149 3121.8505
redmass: 22.1178 26.7694 5.0408 1.7123 5.5431 13.7355 4.5055 21.7792 3.1393 5.4088 2.7455 2.8925 6.1473 8.1743 22.6481 32.4438 7.3602 18.4571 23.8477 8.6061 1.1216 24.4478 25.5332 10.1405 22.2594 15.3129 5.0039 25.2445 12.4318 4.4777 8.6528 10.6505 13.4962 12.9117 12.1708 6.9011 12.9239 11.8587 1.0687 1.1196 12.6256 11.8809 12.5561 1.2019 12.5003 1.8454 13.7248 12.4738 1.2008 11.7881 4.2126 2.9451 2.5266 1.1362 2.3457 11.8832 1.5946 5.8672 1.3555 1.2712 2.0670 2.7887 1.0762 1.1036 7.1716 1.4930 1.5762 1.2153 11.6918 1.1074 10.6496 1.0716 1.0757 1.0416 1.0702 1.0886 1.0588 1.0594 1.0366 1.0591 1.0992 1.1029 1.0572 1.1047 1.1009 1.0993 1.1086
irintensity: 0.0126 0.0047 0.0046 0.0637 0.0816 0.0257 1.3442 0.0381 0.0276 0.3851 0.1152 0.7664 1.4686 0.0191 1.5814 0.0280 0.5744 0.0067 0.1269 0.0394 0.0002 0.3426 0.0000 0.0842 0.8964 1.5165 1.0068 0.0309 0.0008 0.6962 3.0639 13.2875 1.5649 97.3568 100.9181 47.1256 182.5162 199.3335 9.4770 0.0008 34.4712 0.1643 71.5303 2.0515 7.1480 2.2459 13.9214 1.6263 0.2618 50.0151 6.8407 9.7413 0.3050 0.5392 23.5959 4.2000 0.0575 329.3999 20.4139 0.0099 12.4055 1.5413 0.9018 0.0006 24.6033 6.6235 0.5187 12.0706 261.6008 38.8749 543.3682 0.4325 0.5098 13.2197 2.7321 21.4106 1.1355 35.2520 36.7369 48.7345 0.0074 5.3145 9.4291 41.9877 84.4448 50.8693 12.8797
temp: 298.150 k
press: 1.00000 atm
elementType: 17 17 17 17 17 17 16 7 7 7 6 6 6 6 6 6 6 6 6 6 1 1 1 1 1 1 1 1 1 1 1
symmnumber: 1
zpe: 523198.7 jmol-1
zpe.correction: 0.199276 hartree
zpe.thermalcorrener: 0.221987 hartree
zpe.thermalcorrenthalpy: 0.222931 hartree
zpe.thermalcorrgfe: 0.141867 hartree
zpe.sumelectzpe: -3708.771286 hartree
zpe.sumelectthermal: -3708.748575 hartree
zpe.sumelectthermalent: -3708.747631 hartree
zpe.sumelectthermalfe: -3708.828695 hartree
dipole: -5.1765 -0.5352 -0.0010
dipole: 5.2041
quadrupole: -156.5728 -176.0708 -163.9914
quadrupole: 4.1338 -0.0034 0.0091
quadrupole: 8.9722 -10.5258 1.5536 4.1338 -0.0034 0.0091
hfenergy: -3708.9705619 hartree
pointgroup: C01 [X(C10H11Cl6N3S1)]
dipole: 2.0421114 -0.1475283 -0.0021203 debye
polarizability: 292.4034805|-11.4036565|207.5829917|-0.1361383|-0.0476603|153.8760661 unknown
InChI: InChI=1S/C10H11Cl6N3S/c1-2-3-4-5-20-8-18-6(9(11,12)13)17-7(19-8)10(14,15)16/h2-5H2,1H3
charge 0 multiplicity 1
31 atoms
Cl -4.708158 -0.904529 -1.51331
Cl -3.687198 -3.295562 0.015493
Cl -4.70922 -0.892006 1.523437
Cl -2.019653 3.289627 1.520398
Cl 0.579697 3.349327 -0.007506
Cl -2.031251 3.288391 -1.515098
S  1.366599 -1.910416 0.002209
N  0.008368 0.469666 0.000794
N  -1.30047 -1.576874 0.004998
N  -2.404985 0.57395 0.003028
C  5.252646 -0.240044 -0.004311
C  4.097942 -1.271762 -0.00402
C  6.645879 -0.911016 -0.009145
C  2.729291 -0.574548 0.000579
C  7.801188 0.112466 -0.00869
C  -0.104599 -0.89817 0.002804
C  -1.168378 1.141212 0.000701
C  -2.401389 -0.792741 0.00502
C  -3.783676 -1.458915 0.007826
C  -1.138657 2.675918 -0.000641
H  5.16582 0.4160 0.886228
H  5.161693 0.420126 -0.891386
H  4.193151 -1.92657 0.884705
H  4.188974 -1.922572 -0.896096
H  6.735084 -1.572362 0.876446
H  6.731351 -1.56729 -0.89887
H  2.567871 0.04883 -0.893062
H  2.572612 0.046268 0.896861
H  7.754252 0.766307 -0.899857
H  7.757616 0.761695 0.886019
H  8.784802 -0.39131 -0.011853
