program: Gaussian 09
title: /home/michael/molsimp_comfiles/Cr_pbp_1_VAC/Cr_pbp_1_VAC.com auto generated
version: ES64L-G09RevE.01
frameworkgroup: C1[X(C28H18CrN6O4)]
method: UTPSSh
basis: Gen
operation: Freq
keyword: #P
keyword: Geom=AllCheck
keyword: Guess=TCheck
keyword: SCRF=Check
keyword: GenChk
keyword: UTPSSh/ChkBas
keyword: Freq
title: /home/michael/molsimp_comfiles/Cr_pbp_1_VAC/Cr_pbp_1_VAC.com auto gene
converged: YES YES NO YES
polarizability: 6.10586596e+02 3.73052131e-03 8.02621517e+02 6.25274235e-02 -1.89950649e+01 7.75997715e+02
1716.lowfreq: -7.8059 0.0002 0.0008 0.0010 4.7787 6.6744 19.6618 21.4399 24.6941
frequency: 19.6276 21.2403 24.3769 25.8983 27.4018 39.9954 53.2312 61.7504 80.7545 93.9559 109.8137 112.2995 140.0613 142.3394 159.3463 166.6691 177.0024 177.8212 179.3032 192.4864 196.7067 236.4624 247.2689 263.0640 269.3036 289.5152 301.8203 303.7004 314.5976 361.5912 382.0238 387.6401 389.1515 389.9456 410.5204 442.0811 447.5723 451.2436 457.5963 477.8911 478.3496 478.6129 490.9468 495.1167 531.3748 531.4496 539.4020 540.2205 565.1765 575.0433 590.6093 605.9428 638.9176 639.5217 663.9381 666.1945 686.5249 691.7809 699.4600 729.9711 763.6854 765.3603 765.4507 765.9974 771.6367 782.3892 782.9813 795.4254 795.6217 816.4572 826.6172 841.2377 842.7545 842.9035 858.9465 859.0932 892.2775 892.3195 926.5938 930.3963 932.9423 965.4278 975.7411 976.3660 985.0586 987.0641 987.4211 991.1864 998.3882 998.6145 1022.7985 1022.7999 1034.3454 1034.3598 1043.8300 1077.1169 1086.9578 1100.6879 1102.8282 1118.9342 1154.3873 1154.5786 1170.0993 1170.3670 1170.7475 1172.3357 1179.2406 1179.6958 1187.0314 1207.5981 1244.1574 1244.8498 1283.1321 1283.2074 1285.3743 1308.3117 1309.6109 1310.8719 1331.4494 1335.9882 1337.2885 1356.8309 1367.3751 1415.9314 1416.9093 1439.0560 1439.1910 1449.8480 1452.5214 1453.4533 1484.0372 1484.2062 1486.7419 1539.5123 1539.6711 1550.2719 1551.2144 1574.5370 1584.4067 1585.5927 1586.7938 1621.6313 1621.7616 1624.1035 1638.4860 1663.5131 1663.5359 3209.5496 3209.5509 3215.4973 3215.5049 3218.0572 3218.5220 3224.1982 3224.2065 3228.7984 3228.8292 3229.2208 3232.2474 3232.5095 3232.5274 3238.8121 3239.0634 3250.8712 3251.4203
redmass: 4.8250 5.1323 5.7208 6.5919 6.6654 5.8784 10.9383 6.5370 8.1223 6.8995 7.2451 6.7884 7.2719 5.4537 8.8307 8.1734 4.2595 4.3363 10.2652 4.9809 6.8479 6.7817 6.7882 11.1106 5.9821 5.9337 12.7870 12.9000 12.4344 9.8907 6.1856 4.5140 3.5973 3.5741 7.9072 10.6153 4.4924 4.7896 8.8170 3.1413 5.5756 3.0891 3.6112 4.0085 6.9860 7.0331 8.1124 8.0472 8.6025 5.1846 6.1790 7.7149 7.3354 7.3378 4.4169 4.3983 6.6841 7.6352 9.8257 2.8946 1.7518 1.3187 3.9479 1.6742 2.9368 5.5308 5.5593 3.6458 3.6841 2.6293 2.4805 10.2410 6.0305 5.9728 1.3459 1.3357 1.5146 1.5158 6.3241 1.3911 1.4127 6.8724 5.2294 5.2053 1.3191 1.3244 1.3422 1.3059 1.3648 1.3708 1.3163 1.3163 2.2752 2.2741 5.8868 1.6694 1.8994 3.0956 3.0696 6.3719 1.5129 1.5062 1.3014 1.2393 1.2671 1.2468 1.3488 1.3539 2.9100 2.3591 2.8906 2.8988 1.8656 1.8135 6.1110 4.5029 2.7044 3.1680 4.7292 3.0415 3.0237 4.3003 2.8408 3.7487 3.2099 5.3665 5.4278 3.3796 2.1382 2.2600 2.4563 2.4544 2.8677 3.1716 3.1745 5.0975 4.2697 12.5119 10.0924 6.7385 7.7003 5.8635 5.8759 5.8819 6.1221 5.7672 5.7673 1.0876 1.0875 1.0893 1.0893 1.0881 1.0879 1.0955 1.0955 1.0916 1.0916 1.0922 1.0926 1.0987 1.0986 1.0966 1.0967 1.0966 1.0966
irintensity: 16.7537 0.0007 0.0011 1.9529 5.5376 3.8311 17.2253 0.1129 0.3060 9.4467 1.3405 0.9033 0.4416 5.9603 0.0013 0.7245 20.2797 0.0667 1.3921 3.7330 9.1335 1.9436 0.0224 22.2204 0.0374 3.0916 184.3524 117.2603 18.5636 30.6701 13.1106 20.0616 0.4261 7.3529 34.0022 5.9696 4.6060 28.0527 252.0966 0.2545 50.4075 32.5007 0.0031 1.9244 2.4534 0.1333 30.6156 1.2857 1.1480 0.0505 9.1661 280.6809 4.4866 9.7058 0.0000 0.2540 32.6714 98.7869 96.5543 0.0683 157.0414 0.1422 115.2432 106.8045 2.7605 39.2616 5.0278 0.2323 8.3840 16.7961 0.7856 12.7009 0.8899 14.6446 83.5885 0.1461 0.0023 7.6764 24.3145 0.2461 0.0000 1107.0477 3.0613 0.0028 0.4564 0.0001 20.3673 0.6865 0.0137 1.0458 0.0006 0.0066 6.4765 7.0985 0.3003 0.2503 99.7204 21.7805 6.5984 165.1526 6.0219 10.2115 53.9763 25.7941 37.1426 24.6857 6.1612 0.5888 5.7459 4.4499 25.6999 12.6953 12.5968 0.0331 194.8402 444.5900 10.2113 374.1078 4.9918 1.5129 16.9443 332.8909 10.2679 7.4714 185.2256 65.2800 64.6352 494.6905 0.2465 2.6166 15.5303 16.2629 95.2366 32.5457 1.4946 86.9305 16.1997 4137.0386 155.0772 19.5019 121.8679 65.6359 2.3477 229.3844 0.2058 10.3348 0.0601 0.0147 0.0621 0.4187 4.0760 10.8542 4.1953 22.7124 7.0597 0.7050 0.4629 11.1573 10.3817 22.1206 25.4233 10.8164 8.9164 6.2644 4.0755
temp: 298.150 k
press: 1.00000 atm
elementType: 24 8 6 8 6 6 6 6 6 6 6 6 6 6 6 8 8 7 7 1 1 1 1 1 1 7 6 6 6 6 6 6 6 6 7 1 1 1 1 1 1 7 6 6 6 6 6 6 6 6 7 1 1 1 1 1 1
symmnumber: 1
zpe: 1085823.3 jmol-1
zpe.correction: 0.413568 hartree
zpe.thermalcorrener: 0.444579 hartree
zpe.thermalcorrenthalpy: 0.445523 hartree
zpe.thermalcorrgfe: 0.348074 hartree
zpe.sumelectzpe: -1793.420389 hartree
zpe.sumelectthermal: -1793.389378 hartree
zpe.sumelectthermalent: -1793.388434 hartree
zpe.sumelectthermalfe: -1793.485884 hartree
dipole: -0.0006 13.5816 0.9069
dipole: 13.6118
quadrupole: -89.9517 -167.1450 -292.6355
quadrupole: 0.0015 -0.0120 5.6164
quadrupole: 93.2924 16.0990 -109.3914 0.0015 -0.0120 5.6164
hfenergy: -1793.8339571 hartree
pointgroup: C01 [X(C28H18Cr1N6O4)]
dipole: -1.6982129 5.0784809 -0.0660742 debye
polarizability: 767.9810875|9.9725203|810.221731|8.0623479|1.3398196|611.0030091 unknown
InChI: InChI=1S/C12H6N2O4.2C8H6N2.Cr/c15-11(16)9-5-1-3-7(13-9)8-4-2-6-10(14-8)12(17)18;2*1-2-4-8-7(3-1)5-6-9-10-8;/h1-6H;2*1-6H;/q-4;2*-1;+6
charge 0 multiplicity 3
57 atoms
Cr -0.01676044 0.17561682 -0.04816154
O  4.03173353 0.87911661 0.16232737
C  2.78220931 0.89676834 0.09835922
O  2.03432145 -0.16728508 0.05566328
C  2.02167959 2.19032247 0.0647229
C  2.55845136 3.46180645 0.09752214
C  1.6790892 4.57155537 0.05708865
C  0.30790958 4.36849045 -0.01399841
C  -0.19858936 3.05568158 -0.04542158
C  -1.56425062 2.60962503 -0.1171883
C  -2.74583306 3.37175004 -0.17442472
C  -3.9740721 2.72810631 -0.23990319
C  -4.03117011 1.31327708 -0.2487144
C  -2.84977966 0.60147924 -0.19130231
C  -2.70616868 -0.89221441 -0.19023522
O  -1.47667088 -1.3120932 -0.12921397
O  -3.70664867 -1.64310498 -0.24449073
N  -1.64220179 1.23113933 -0.12695592
N  0.67589201 1.98906212 -0.00508195
H  3.63283531 3.59460716 0.15313712
H  2.07835303 5.57947342 0.08174742
H  -0.37932157 5.20718291 -0.04569821
H  -2.68414283 4.45453937 -0.16675063
H  -4.88943397 3.30783144 -0.28428195
H  -4.97771879 0.78745834 -0.29928862
N  -0.05511621 -0.04976566 2.02818464
C  -0.40476476 0.92169717 2.91488636
C  -0.42447507 0.69041481 4.27442551
C  -0.07231481 -0.58965159 4.74074111
C  -0.05331054 -0.97036426 6.10850588
C  0.30729885 -2.25487468 6.45199315
C  0.66321129 -3.20857172 5.45657169
C  0.65619876 -2.87231811 4.12242575
C  0.28639455 -1.55321539 3.74055033
N  0.28570754 -1.25576852 2.41262303
H  -0.66630029 1.8805713 2.48546804
H  -0.70732944 1.47987815 4.96244762
H  -0.32548949 -0.23949044 6.86326401
H  0.32255514 -2.55148522 7.49577179
H  0.94222111 -4.21192511 5.76105345
H  0.92393702 -3.58534882 3.34978976
N  0.15763554 -0.03235609 -2.11935316
C  -0.09980351 0.94669007 -3.02898646
C  0.01982099 0.72684763 -4.385299
C  0.41836625 -0.54941991 -4.82386803
C  0.57741955 -0.91863159 -6.18565651
C  0.9718058 -2.20037667 -6.5012182
C  1.22434203 -3.1625717 -5.48265018
C  1.08067179 -2.83754149 -4.15344905
C  0.67320035 -1.52152313 -3.80035294
N  0.53648546 -1.23524642 -2.47701548
H  -0.40429141 1.90204427 -2.62054401
H  -0.1914472 1.52219432 -5.09199756
H  0.38363112 -0.18131372 -6.95813704
H  1.09393595 -2.48821028 -7.54041046
H  1.53345442 -4.1634591 -5.76540035
H  1.26820336 -3.55716631 -3.36349017
