program: Gaussian 09
title: /home/michael/molsimp_comfiles/Co_3a1_1_OH/Co_3a1_1_OH.com auto generated
version: ES64L-G09RevE.01
frameworkgroup: C1[X(C31H24CoN7O)]
method: UTPSSh
basis: Gen
operation: Freq
keyword: #P
keyword: Geom=AllCheck
keyword: Guess=TCheck
keyword: SCRF=Check
keyword: GenChk
keyword: UTPSSh/ChkBas
keyword: Freq
title: /home/michael/molsimp_comfiles/Co_3a1_1_OH/Co_3a1_1_OH.com auto genera
converged: YES YES NO YES
polarizability: 6.82777098e+02 2.19074032e+00 7.88082685e+02 1.04403907e+01 5.70488728e+01 5.81517275e+02
1716.lowfreq: -8.6834 -3.1471 -0.0006 -0.0005 0.0006 6.3886 17.1885 24.1305 31.8054
frequency: 17.1616 23.6326 31.3267 39.6869 42.6614 49.7791 58.6398 82.0074 97.2431 114.3337 121.1178 128.4407 131.9379 152.0782 168.5058 172.6444 177.2503 180.3036 189.0354 199.1292 226.4072 251.0032 256.9875 268.6282 283.4013 312.4186 316.6773 334.4742 349.7955 366.4070 374.9583 389.2468 396.5545 404.2834 427.0841 432.5380 447.8676 461.2539 463.7550 472.7116 480.0344 481.4849 494.8257 498.1447 504.2734 525.6583 534.0023 534.6123 541.6651 543.9744 553.0389 562.0298 635.3174 637.5376 641.4444 647.5806 652.8222 658.3778 662.8351 668.8782 680.1692 731.6226 741.8498 756.6946 762.0139 764.9772 765.7775 784.5529 785.5569 788.0923 790.6344 792.6330 798.3471 837.2663 840.8600 844.2143 846.3280 846.7882 850.7212 890.0153 892.2701 912.7614 924.3217 938.0382 973.3700 976.0785 983.2384 986.1943 995.8291 996.1199 997.2291 998.8826 1005.8746 1023.1721 1024.1166 1025.6395 1029.7714 1032.5710 1033.6934 1034.5155 1037.5905 1040.3953 1046.2226 1060.8759 1069.0206 1092.1719 1099.7387 1104.2205 1120.2219 1129.2233 1143.6007 1155.8675 1157.4314 1161.0477 1172.6094 1173.9682 1181.9191 1187.7844 1192.3162 1193.3641 1223.5708 1247.4956 1253.7685 1286.9635 1287.1575 1304.0568 1313.2670 1316.6525 1319.4406 1322.6823 1330.2646 1337.4998 1341.9623 1343.9251 1377.6298 1382.2702 1436.3625 1439.7088 1441.9653 1455.6569 1456.7218 1473.8915 1485.2730 1486.1342 1486.7125 1494.4898 1512.2964 1540.0820 1541.0657 1541.2735 1584.5989 1587.2429 1608.0948 1615.6073 1619.9413 1620.4163 1623.9711 1643.7031 1648.4890 1652.4983 1660.8761 1661.6610 3211.4510 3212.3018 3218.7403 3218.8141 3226.9445 3227.1645 3228.0086 3229.0351 3232.1296 3232.9228 3233.1421 3233.8941 3233.9658 3235.0723 3239.9552 3244.5353 3244.9494 3249.5203 3251.7739 3252.5057 3254.9295 3286.0038 3286.8820 3649.3321
redmass: 5.2966 5.9324 4.8804 4.7547 5.9758 4.9449 5.4232 5.6637 4.3211 5.6618 4.3526 6.1789 5.6946 6.5491 4.4901 4.0589 5.8121 5.6864 6.1890 6.7817 5.5550 6.0384 4.8687 5.5931 6.1154 5.0962 7.3402 7.6050 7.3222 7.2589 7.6134 3.5946 3.6551 4.7478 5.6482 3.4205 3.8606 5.2719 3.8304 2.3458 3.1321 3.8777 1.3868 3.7292 3.9207 3.2020 6.9422 6.8171 8.3071 8.1583 5.4629 13.3337 3.9627 7.1776 7.1432 7.1330 7.0551 7.0758 4.3085 4.3639 6.9518 6.7921 4.8229 2.0163 1.9944 1.5388 1.3642 1.3002 4.3208 4.6372 4.0243 3.6196 1.6763 2.2772 4.6821 1.4797 4.8126 4.7366 1.4948 1.4981 1.5073 1.3343 1.3133 1.4168 5.2706 4.9652 1.3500 1.3230 1.2053 1.3127 1.3586 1.3335 1.3728 1.3380 1.3191 1.3221 1.3295 1.3334 2.2977 2.3073 7.1680 7.4550 5.1572 7.2179 2.4204 2.0998 3.2304 3.0935 1.9209 1.6218 1.7007 1.5075 1.4918 1.6170 1.2004 1.1791 1.1064 1.1377 1.4108 1.3938 1.3805 3.1034 3.0101 1.7529 1.7391 1.8405 2.1399 2.7826 2.9812 3.2427 3.6043 2.9888 2.3358 2.9435 2.7720 4.5242 2.3313 6.5263 6.1511 1.9899 2.0293 2.2017 2.3246 2.3239 2.3287 2.4828 2.9391 3.1270 3.0351 3.0696 6.6469 6.6922 5.9518 5.8011 6.4783 5.9992 5.8899 5.3532 5.7264 5.8962 5.6721 5.7137 1.0873 1.0874 1.0895 1.0895 1.0957 1.0958 1.0903 1.0890 1.0918 1.0932 1.0904 1.0989 1.0987 1.0930 1.0914 1.0953 1.0952 1.0985 1.0941 1.0977 1.0969 1.0940 1.0940 1.0662
irintensity: 0.2641 2.1468 2.3161 2.6662 1.0324 1.9099 4.9913 0.6183 0.5361 1.8945 3.3552 0.8054 0.9080 1.8821 1.8461 2.7308 25.1887 0.8636 6.9694 5.0015 1.7036 4.6479 1.0513 1.5590 2.2361 0.0700 1.0663 30.3091 3.1759 6.3662 16.2116 1.9266 5.4639 19.6227 4.8731 4.5712 11.8748 6.5465 3.3025 66.4972 7.3808 23.6097 83.8214 0.7948 6.8859 6.7169 0.9919 3.6685 20.3793 7.1417 0.7401 86.3268 2.0276 8.3548 8.9375 10.6867 7.8376 23.4367 0.2291 0.1781 17.4398 0.1782 22.1523 0.8829 5.6548 22.4493 63.0990 193.6993 58.3391 25.9190 14.0861 10.5707 5.9113 5.4978 12.8382 74.3055 13.5498 7.1103 81.4391 3.1275 5.3854 0.4924 0.0331 0.0177 5.2864 2.0439 0.3062 0.1457 140.2540 30.4101 5.1621 35.1670 1.6340 0.0730 0.0105 0.0078 0.0290 0.0588 6.1952 6.9585 12.1559 24.6296 0.0672 11.5838 5.1620 0.5013 3.4294 6.6598 31.1043 6.8361 6.6307 9.8097 14.0072 5.5856 6.4638 5.4511 0.6376 13.1623 4.0891 2.3700 5.8232 12.1830 11.1731 1.3490 2.3139 3.0327 18.2895 23.3173 22.7178 57.7141 30.7231 11.2488 53.5610 24.2488 3.6242 41.8467 2.4127 95.8236 93.7817 5.1431 23.2918 11.4289 97.3118 49.7449 7.0585 5.8978 142.0526 33.9025 49.7372 14.7798 63.7925 24.1832 14.1444 18.2210 21.9890 50.1231 41.5961 43.9790 45.2821 10.5869 4.4504 4.1284 0.3574 0.3062 2.5593 3.8351 13.9830 11.1269 18.5153 3.6094 2.8572 1.0136 3.7606 19.1209 16.4485 1.0369 0.6833 0.3523 0.6755 5.5439 1.0002 6.1595 0.0402 20.6992 3.6084 255.2093
temp: 298.150 k
press: 1.00000 atm
elementType: 27 6 6 6 6 6 6 6 6 6 6 6 6 6 6 7 7 7 6 1 1 1 1 1 1 1 1 1 1 1 8 1 7 6 6 6 6 6 6 6 6 7 1 1 1 1 1 1 7 6 6 6 6 6 6 6 6 7 1 1 1 1 1 1
symmnumber: 1
zpe: 1307013.6 jmol-1
zpe.correction: 0.497815 hartree
zpe.thermalcorrener: 0.528991 hartree
zpe.thermalcorrenthalpy: 0.529935 hartree
zpe.thermalcorrgfe: 0.435435 hartree
zpe.sumelectzpe: -1798.721776 hartree
zpe.sumelectthermal: -1798.690600 hartree
zpe.sumelectthermalent: -1798.689656 hartree
zpe.sumelectthermalfe: -1798.784156 hartree
dipole: -2.1080 7.3355 10.1372
dipole: 12.6892
quadrupole: -83.3053 -115.9775 -174.7148
quadrupole: 4.3827 0.8264 -0.7847
quadrupole: 41.3605 8.6884 -50.0489 4.3827 0.8264 -0.7847
hfenergy: -1799.2195913 hartree
pointgroup: C01 [X(C31H24Co1N7O1)]
dipole: 4.8410775 0.3237085 1.175733 debye
polarizability: 695.5761117|116.4068462|676.7122522|-14.9320475|12.7417414|680.0886944 unknown
InChI: InChI=1S/C15H11N3.2C8H6N2.Co.H2O/c1-3-10-16-12(6-1)14-8-5-9-15(18-14)13-7-2-4-11-17-13;2*1-2-4-8-7(3-1)5-6-9-10-8;;/h1-11H;2*1-6H;;1H2/q-3;2*-1;+6;/p-1
charge 2 multiplicity 1
64 atoms
Co 0.09307543 0.36329184 0.09383379
C  0.21472719 4.59727546 0.14143698
C  1.58883875 4.83386395 0.17136535
C  2.47379466 3.75275586 0.17774831
C  1.95525884 2.45983538 0.15559171
C  2.74630001 1.21567668 0.14394132
C  4.1350797 1.06470656 0.15154266
C  4.65820615 -0.23204135 0.16043536
C  3.81789499 -1.34906549 0.17052338
C  2.4361272 -1.13828638 0.16183996
C  1.35240312 -2.13439805 0.18166214
C  1.52100656 -3.51711115 0.23130486
C  0.38860423 -4.33401163 0.26206117
C  -0.87840966 -3.75228514 0.23790629
C  -0.98326806 -2.36245398 0.17798866
N  0.10397403 -1.58165182 0.15430362
N  1.9586935 0.12087659 0.1396808
N  0.6036706 2.24464364 0.13029573
C  -0.24586196 3.280328 0.12039695
H  -0.4997177 5.41178338 0.13202254
H  1.97330068 5.84769775 0.18734825
H  3.54602712 3.90850355 0.19654933
H  4.78782931 1.92899417 0.1535041
H  5.73316799 -0.37337074 0.16443763
H  4.22666666 -2.3518991 0.18480249
H  2.51622751 -3.9449577 0.25023501
H  0.49991566 -5.41192614 0.30479044
H  -1.77887413 -4.35448629 0.26030729
H  -1.93807762 -1.85240901 0.14327482
H  -1.2978293 3.01995122 0.09358116
O  -1.75140465 0.67330716 -0.04146362
H  -2.09817582 0.38194203 0.82364425
N  -0.06669185 0.33596204 2.07531995
C  0.9262169 0.70134673 2.93103555
C  0.76056351 0.63166629 4.29898213
C  -0.46268037 0.16668286 4.81134619
C  -0.76721347 0.04190827 6.19196406
C  -2.00535689 -0.42699871 6.57256865
C  -2.98500217 -0.78795755 5.60433397
C  -2.7237511 -0.67899032 4.25791905
C  -1.45284367 -0.19814437 3.84030923
N  -1.21896774 -0.1016131 2.50536096
H  1.84815107 1.05087227 2.49055533
H  1.56809143 0.9342105 4.95651372
H  -0.01741168 0.31873031 6.92566666
H  -2.24545242 -0.52545715 7.62616033
H  -3.94982259 -1.1533132 5.93996937
H  -3.45768721 -0.94827671 3.50609261
N  0.08607485 0.30290091 -1.88831929
C  0.79770601 1.1580372 -2.67720401
C  0.7299023 1.09762748 -4.05263476
C  -0.09474369 0.12723742 -4.64758184
C  -0.26246698 -0.04706153 -6.04601947
C  -1.10100354 -1.03730642 -6.50959659
C  -1.80151031 -1.88838212 -5.60895218
C  -1.66104513 -1.74571704 -4.24754488
C  -0.80198638 -0.73049569 -3.74350253
N  -0.68930589 -0.61557179 -2.39285038
H  1.41306777 1.8916096 -2.17860128
H  1.30490606 1.79430536 -4.65271808
H  0.27365214 0.60458215 -6.72820156
H  -1.23457577 -1.17646756 -7.57751746
H  -2.45378061 -2.65815757 -6.00794663
H  -2.18787959 -2.38403381 -3.54642153
