program: Gaussian 09
title: 000032412
version: EM64L-G09RevD.01
frameworkgroup: C1[X(C3H8N2O2)]
method: RPBEPBE
basis: SDD
operation: Freq
keyword: #pfreq=noraman
keyword: PBEPBE/SDD
title: #p freq=noraman PBEPBE/SDD
converged: YES YES NO NO
title: Mulliken charges:
elementType: O O N N C C C H H H H H H H H
charge: -0.462088 -0.290022 -0.347626 -0.595898 -0.336330 -0.374666 0.228513 0.209101 0.258310 0.245183 0.193945 0.328608 0.288379 0.271436 0.383156
chargesum: 0.00000
title: Mulliken charges with hydrogens summed into heavy atoms:
elementType: O O N N C C C
charge: -0.078932 -0.290022 -0.019018 -0.036084 0.131082 0.064462 0.228513
polarizability: 6.83335426e+01 -2.14175623e+00 5.33814755e+01 4.49885710e+00 1.08949041e+00 3.70002887e+01
1716.lowfreq: -17.4879 -7.0108 -0.0008 -0.0003 0.0005 10.7479 39.0550 72.8864 95.6985
frequency: 38.7260 72.8841 95.6965 102.1450 256.0566 303.5864 372.5017 443.9859 472.5311 515.4738 557.1298 630.2191 704.3571 767.4398 868.7437 963.5249 1031.8036 1043.5353 1112.7763 1154.9679 1189.0845 1267.8269 1287.7930 1306.5549 1326.3001 1375.2423 1451.3208 1477.7624 1495.9049 1639.3986 1694.9805 2918.6433 3017.9769 3052.4084 3093.0184 3525.8377 3580.1055 3586.1091 3657.4617
redmass: 2.8413 1.3570 4.3522 1.9688 3.1320 3.2270 5.3439 1.2756 1.0900 4.1202 1.1738 4.0430 11.8765 1.2313 2.6855 1.6396 2.8893 3.0573 3.6970 1.6011 1.8589 1.6296 1.3674 1.1073 1.2140 1.3294 1.0925 1.0938 1.9506 1.0970 7.4052 1.0701 1.0616 1.0908 1.1058 1.0452 1.0775 1.0654 1.1005
irintensity: 5.4757 18.0316 3.1409 9.6670 4.2924 5.7604 5.1324 205.8175 359.6130 38.9040 26.5769 12.3368 35.0656 13.5918 16.6651 19.4214 69.6246 111.1835 51.2768 96.4636 63.9097 6.6363 13.2527 6.8687 2.0954 3.5572 13.4623 7.5755 228.8712 37.0097 335.7281 87.8235 33.4688 12.8509 23.9021 1.7158 39.8200 43.3755 6.8921
temp: 298.150 k
press: 1.00000 atm
elementType: 8 8 7 7 6 6 6 1 1 1 1 1 1 1 1
symmnumber: 1
zpe: 319712.8 jmol-1
zpe.correction: 0.121772 hartree
zpe.thermalcorrener: 0.130514 hartree
zpe.thermalcorrenthalpy: 0.131458 hartree
zpe.thermalcorrgfe: 0.087420 hartree
zpe.sumelectzpe: -378.501270 hartree
zpe.sumelectthermal: -378.492528 hartree
zpe.sumelectthermalent: -378.491584 hartree
zpe.sumelectthermalfe: -378.535623 hartree
dipole: 1.4823 -2.2979 -1.3161
dipole: 3.0347
quadrupole: -32.9225 -42.1840 -44.0318
quadrupole: -0.9445 -1.4296 -2.3807
quadrupole: 6.7902 -2.4712 -4.3190 -0.9445 -1.4296 -2.3807
hfenergy: -378.6230424 hartree
pointgroup: C01 [X(C3H8N2O2)]
dipole: 0.5811118 1.0103491 0.2589313 debye
dipolederiv: -1.2928535 0.3073828 0.1672571 0.413787 -0.402163 -0.1181737 0.2098587 -0.0996829 -0.5079388 -0.6528669 0.0161541 0.0608917 -0.0830066 -1.1008503 0.0616658 0.0639276 0.0570256 -0.3887063 -1.0629715 -0.2338758 0.047005 -0.435486 -0.5985265 0.1347337 0.1156426 0.1328269 -0.5495875 -0.7490765 0.1103401 -0.0380696 0.1395459 -0.3078542 -0.2110042 0.0288982 -0.2617692 -0.7677633 0.5946556 0.0007405 -0.0432761 -0.0797986 0.1719216 0.0069323 -0.175995 -0.0450745 0.2167329 0.6166519 -0.1561124 -0.0336031 -0.1097905 0.2676832 0.1152882 0.0699893 0.1582071 0.2418452 1.8614432 0.050095 -0.3916082 0.2570701 1.6012023 -0.1427455 -0.4574451 -0.130977 0.4297089 -0.017765 -0.0419035 0.049084 -0.0586189 -0.0487893 0.1311124 0.0406932 0.099777 0.0074137 0.0306863 -0.0232316 -0.0178415 0.0284365 -0.0098814 -0.1207614 -0.013346 -0.0604394 0.0116271 0.0400522 -0.0311184 0.0488766 -0.03742 -0.0323876 0.1038514 0.0481942 0.0623941 0.0245441 -0.0325046 0.053553 0.0242871 0.0727309 -0.1326973 -0.1895539 0.0092093 -0.1381809 -0.0810901 0.1351383 -0.0107668 0.0643094 0.0312224 0.1691269 0.0032891 0.0855689 -0.0077185 0.3399557 0.0862362 0.0419357 0.0010657 0.0187736 0.1874824 0.1110185 -0.060145 0.1533753 0.2645714 0.0905244 -0.0327666 0.0359893 -0.0687397 0.0882045 0.0627112 0.0075807 0.0406302 0.3653273 0.35265 -0.0504262 0.0256327 -0.0887062 0.1475289 0.0516361 0.0273682 0.0396062 0.3933599 unknown
polarizability: 68.1642104|0.9582015|52.8511361|-5.3510775|-3.1709971|37.6999603 unknown
InChI: InChI=1S/C3H8N2O2/c4-1-2-5-3(6)7/h5-6H,1-2,4H2
charge 0 multiplicity 1
15 atoms
O  -2.635166 0.52493 0.368404
O  -1.247144 -1.362515 0.133048
N  -0.480021 0.814989 -0.323683
N  3.163965 -0.167163 0.117848
C  0.892558 0.427314 -0.691105
C  1.800363 0.166753 0.54236
C  -1.408939 -0.116327 0.058415
H  1.325022 1.231515 -1.31369
H  0.863565 -0.49317 -1.298406
H  1.375052 -0.688237 1.097492
H  1.751001 1.049464 1.220201
H  -0.762731 1.794673 -0.317665
H  3.608643 -0.963542 0.570718
H  3.793489 0.612478 -0.071281
H  -3.285157 -0.175162 0.631644
