program: Gaussian 09
title: 000032381
version: EM64L-G09RevD.01
frameworkgroup: C1[X(C4H6Br2O2)]
method: RPBEPBE
basis: SDD
operation: Freq
keyword: #p
keyword: freq=noraman
keyword: PBEPBE/SDD
title: #p freq=noraman PBEPBE/SDD
converged: NO YES NO NO
title: Mulliken charges:
elementType: Br Br O O C C C C H H H H H H
charge: -0.001685 0.007504 -0.212388 -0.208330 -0.276784 -0.635197 0.339814 -0.745460 0.336570 0.305051 0.314350 0.252571 0.262326 0.261658
chargesum: 0.00000
title: Mulliken charges with hydrogens summed into heavy atoms:
elementType: Br Br O O C C C C
charge: -0.001685 0.007504 -0.212388 -0.208330 0.059786 -0.015796 0.339814 0.031095
polarizability: 1.10730254e+02 -1.78560380e+01 8.49284544e+01 -1.77743930e+00 2.77949924e+00 5.37038536e+01
1716.lowfreq: -9.5173 -6.3985 -1.1770 -0.0005 -0.0003 0.0003 44.4008 55.4574 79.6041
frequency: 44.3657 55.4560 79.5990 98.2457 117.5042 173.1761 192.1281 272.4750 392.4612 414.5243 538.0581 571.9877 607.2403 643.0587 757.0293 886.8800 955.3806 985.4933 1044.6710 1092.9272 1150.2109 1166.7033 1204.0489 1240.5245 1331.3199 1387.8990 1431.2116 1450.4187 1451.0843 1694.2597 3009.7834 3086.0561 3096.1646 3104.8267 3149.6622 3179.6351
redmass: 12.2911 2.1983 1.4701 3.4667 10.7461 33.4108 2.9983 9.3733 4.3081 2.8658 4.1282 4.8027 5.1731 4.8792 2.8323 3.0250 2.2142 2.2974 1.6602 1.8954 1.5198 2.6158 1.2318 1.1791 1.3674 1.2473 1.1114 1.0460 1.0550 10.1553 1.0372 1.0577 1.0970 1.0874 1.1010 1.1114
irintensity: 0.3269 4.1923 0.6934 2.4898 1.2587 1.8929 8.2231 7.5891 15.8270 5.7548 59.1670 71.5583 18.5985 34.9341 35.3965 97.8815 117.4809 169.1202 7.5030 137.6431 26.7682 218.4750 10.1748 11.0253 4.4457 61.0657 13.5156 21.2962 25.7901 177.0062 0.0944 2.5895 2.9952 5.6610 7.6154 0.4513
temp: 298.150 k
press: 1.00000 atm
elementType: 35 35 8 8 6 6 6 6 1 1 1 1 1 1
symmnumber: 1
zpe: 251553.6 jmol-1
zpe.correction: 0.095812 hartree
zpe.thermalcorrener: 0.105837 hartree
zpe.thermalcorrenthalpy: 0.106782 hartree
zpe.thermalcorrgfe: 0.056686 hartree
zpe.sumelectzpe: -332.762678 hartree
zpe.sumelectthermal: -332.752653 hartree
zpe.sumelectthermalent: -332.751708 hartree
zpe.sumelectthermalfe: -332.801804 hartree
dipole: -0.2950 0.9119 -1.8367
dipole: 2.0717
quadrupole: -72.1966 -57.4609 -68.7101
quadrupole: 1.9100 -3.3773 -5.1121
quadrupole: -6.0740 8.6616 -2.5876 1.9100 -3.3773 -5.1121
hfenergy: -332.85849 hartree
pointgroup: C01 [X(C4H6Br2O2)]
dipole: -0.1294971 -0.5216852 -0.6127188 debye
dipolederiv: -0.2627712 0.2023138 -0.0695845 -0.0022592 -0.8033856 0.2113923 -0.0070416 0.2499812 -0.1909876 -0.2612539 0.1913661 -0.0567053 0.2488278 -0.4692347 0.1460528 -0.0943015 0.1638997 -0.1768797 -1.7134731 -0.7585487 0.3323511 -0.5592957 -0.8156228 0.0705261 0.1601298 -0.0827972 -0.4288691 -0.6606262 -0.1721903 0.0896305 0.0801459 -0.3813581 -0.3047988 0.3971129 -0.0773483 -0.7525121 0.8415431 0.1190098 0.0644983 0.4395413 1.4279954 -0.3728881 0.2675809 -0.0924552 0.2221837 0.1263053 -0.32119 0.1376367 -0.3083759 0.5195586 -0.2412778 0.1353417 -0.1999948 0.1995496 1.7821437 0.7777112 -0.3785599 0.2886352 0.6078754 0.4101806 -0.7075982 0.104201 1.0377828 -0.1527389 -0.1440102 -0.0721317 -0.1809437 -0.1881483 -0.1425374 -0.1516697 -0.2079147 -0.1543198 0.0568118 0.058509 0.0157787 -0.0545642 -0.0456895 0.0895909 -0.0490827 0.0054107 0.0066976 0.0202232 0.011306 -0.0419785 -0.0354344 -0.0606908 0.0287134 -0.0390311 0.0431609 0.0726562 0.0981929 0.0427018 -0.048278 0.0519005 0.0088885 0.0640583 0.0118647 0.0142864 -0.0371997 -0.0326724 -0.0545995 0.0585376 -0.0320911 0.1032595 -0.0156106 0.0884129 0.0027435 0.0647876 0.0468372 0.0852976 -0.0096412 0.0592192 0.0122947 -0.0241953 0.0089207 0.0104788 0.1434471 0.1114785 -0.0376767 -0.0215539 0.0046943 0.0842576 0.0807936 -0.0206389 0.0663481 -0.0063367 unknown
polarizability: 78.5591079|-9.6381137|109.6887491|4.1270357|-20.7312299|61.1147046 unknown
InChI: InChI=1S/C4H6Br2O2/c1-3(7)8-4(6)2-5/h4H,2H2,1H3
charge 0 multiplicity 1
14 atoms
Br 0.426058 2.509096 -0.728348
Br 2.65666 -1.450798 0.759248
O  -0.195934 -0.297455 -0.46548
O  -1.731427 0.149909 1.252444
C  0.730813 0.633238 0.108238
C  2.146383 0.237391 -0.252881
C  -1.458308 -0.459287 0.206334
C  -2.303808 -1.441935 -0.5565
H  0.537729 0.801973 1.178576
H  2.871852 0.998496 0.06165
H  2.24617 -0.004726 -1.32001
H  -3.25275 -1.605095 -0.027261
H  -1.76451 -2.398235 -0.669942
H  -2.502228 -1.057071 -1.572069
